zookeeper-dev mailing list archives

Site index · List index
Message view « Date » · « Thread »
Top « Date » · « Thread »
From Apache Jenkins Server <jenk...@builds.apache.org>
Subject ZooKeeper-trunk-jdk8 - Build # 993 - Still Failing
Date Sun, 26 Mar 2017 12:05:04 GMT
See https://builds.apache.org/job/ZooKeeper-trunk-jdk8/993/

###################################################################################
########################## LAST 60 LINES OF THE CONSOLE ###########################
[...truncated 67.53 MB...]
    [junit] 	at org.apache.zookeeper.ClientCnxn$SendThread.run(ClientCnxn.java:1214)
    [junit] 2017-03-26 12:04:09,677 [myid:127.0.0.1:19328] - INFO  [main-SendThread(127.0.0.1:19328):ClientCnxn$SendThread@1113]
- Opening socket connection to server 127.0.0.1/127.0.0.1:19328. Will not attempt to authenticate
using SASL (unknown error)
    [junit] 2017-03-26 12:04:09,677 [myid:127.0.0.1:19328] - WARN  [main-SendThread(127.0.0.1:19328):ClientCnxn$SendThread@1235]
- Session 0x300c6d01a800000 for server 127.0.0.1/127.0.0.1:19328, unexpected error, closing
socket connection and attempting reconnect
    [junit] java.net.ConnectException: Connection refused
    [junit] 	at sun.nio.ch.SocketChannelImpl.checkConnect(Native Method)
    [junit] 	at sun.nio.ch.SocketChannelImpl.finishConnect(SocketChannelImpl.java:717)
    [junit] 	at org.apache.zookeeper.ClientCnxnSocketNIO.doTransport(ClientCnxnSocketNIO.java:357)
    [junit] 	at org.apache.zookeeper.ClientCnxn$SendThread.run(ClientCnxn.java:1214)
    [junit] 2017-03-26 12:04:09,797 [myid:127.0.0.1:19328] - INFO  [main-SendThread(127.0.0.1:19328):ClientCnxn$SendThread@1113]
- Opening socket connection to server 127.0.0.1/127.0.0.1:19328. Will not attempt to authenticate
using SASL (unknown error)
    [junit] 2017-03-26 12:04:09,797 [myid:127.0.0.1:19328] - WARN  [main-SendThread(127.0.0.1:19328):ClientCnxn$SendThread@1235]
- Session 0x300c6d01a800001 for server 127.0.0.1/127.0.0.1:19328, unexpected error, closing
socket connection and attempting reconnect
    [junit] java.net.ConnectException: Connection refused
    [junit] 	at sun.nio.ch.SocketChannelImpl.checkConnect(Native Method)
    [junit] 	at sun.nio.ch.SocketChannelImpl.finishConnect(SocketChannelImpl.java:717)
    [junit] 	at org.apache.zookeeper.ClientCnxnSocketNIO.doTransport(ClientCnxnSocketNIO.java:357)
    [junit] 	at org.apache.zookeeper.ClientCnxn$SendThread.run(ClientCnxn.java:1214)
    [junit] 2017-03-26 12:04:09,955 [myid:127.0.0.1:19331] - INFO  [main-SendThread(127.0.0.1:19331):ClientCnxn$SendThread@1113]
- Opening socket connection to server 127.0.0.1/127.0.0.1:19331. Will not attempt to authenticate
using SASL (unknown error)
    [junit] 2017-03-26 12:04:09,955 [myid:127.0.0.1:19331] - WARN  [main-SendThread(127.0.0.1:19331):ClientCnxn$SendThread@1235]
- Session 0x100c6d01a6d0002 for server 127.0.0.1/127.0.0.1:19331, unexpected error, closing
socket connection and attempting reconnect
    [junit] java.net.ConnectException: Connection refused
    [junit] 	at sun.nio.ch.SocketChannelImpl.checkConnect(Native Method)
    [junit] 	at sun.nio.ch.SocketChannelImpl.finishConnect(SocketChannelImpl.java:717)
    [junit] 	at org.apache.zookeeper.ClientCnxnSocketNIO.doTransport(ClientCnxnSocketNIO.java:357)
    [junit] 	at org.apache.zookeeper.ClientCnxn$SendThread.run(ClientCnxn.java:1214)
    [junit] 2017-03-26 12:04:10,151 [myid:127.0.0.1:19352] - INFO  [main-SendThread(127.0.0.1:19352):ClientCnxn$SendThread@1113]
- Opening socket connection to server 127.0.0.1/127.0.0.1:19352. Will not attempt to authenticate
using SASL (unknown error)
    [junit] 2017-03-26 12:04:10,151 [myid:127.0.0.1:19352] - WARN  [main-SendThread(127.0.0.1:19352):ClientCnxn$SendThread@1235]
- Session 0x300c6d1c4a20000 for server 127.0.0.1/127.0.0.1:19352, unexpected error, closing
socket connection and attempting reconnect
    [junit] java.net.ConnectException: Connection refused
    [junit] 	at sun.nio.ch.SocketChannelImpl.checkConnect(Native Method)
    [junit] 	at sun.nio.ch.SocketChannelImpl.finishConnect(SocketChannelImpl.java:717)
    [junit] 	at org.apache.zookeeper.ClientCnxnSocketNIO.doTransport(ClientCnxnSocketNIO.java:357)
    [junit] 	at org.apache.zookeeper.ClientCnxn$SendThread.run(ClientCnxn.java:1214)
    [junit] 2017-03-26 12:04:10,230 [myid:127.0.0.1:19325] - INFO  [main-SendThread(127.0.0.1:19325):ClientCnxn$SendThread@1113]
- Opening socket connection to server 127.0.0.1/127.0.0.1:19325. Will not attempt to authenticate
using SASL (unknown error)
    [junit] 2017-03-26 12:04:10,230 [myid:127.0.0.1:19325] - WARN  [main-SendThread(127.0.0.1:19325):ClientCnxn$SendThread@1235]
- Session 0x200c6d01ab90000 for server 127.0.0.1/127.0.0.1:19325, unexpected error, closing
socket connection and attempting reconnect
    [junit] java.net.ConnectException: Connection refused
    [junit] 	at sun.nio.ch.SocketChannelImpl.checkConnect(Native Method)
    [junit] 	at sun.nio.ch.SocketChannelImpl.finishConnect(SocketChannelImpl.java:717)
    [junit] 	at org.apache.zookeeper.ClientCnxnSocketNIO.doTransport(ClientCnxnSocketNIO.java:357)
    [junit] 	at org.apache.zookeeper.ClientCnxn$SendThread.run(ClientCnxn.java:1214)
    [junit] 2017-03-26 12:04:10,283 [myid:127.0.0.1:19325] - INFO  [main-SendThread(127.0.0.1:19325):ClientCnxn$SendThread@1113]
- Opening socket connection to server 127.0.0.1/127.0.0.1:19325. Will not attempt to authenticate
using SASL (unknown error)
    [junit] 2017-03-26 12:04:10,283 [myid:127.0.0.1:19325] - WARN  [main-SendThread(127.0.0.1:19325):ClientCnxn$SendThread@1235]
- Session 0x200c6d01ab90001 for server 127.0.0.1/127.0.0.1:19325, unexpected error, closing
socket connection and attempting reconnect
    [junit] java.net.ConnectException: Connection refused
    [junit] 	at sun.nio.ch.SocketChannelImpl.checkConnect(Native Method)
    [junit] 	at sun.nio.ch.SocketChannelImpl.finishConnect(SocketChannelImpl.java:717)
    [junit] 	at org.apache.zookeeper.ClientCnxnSocketNIO.doTransport(ClientCnxnSocketNIO.java:357)
    [junit] 	at org.apache.zookeeper.ClientCnxn$SendThread.run(ClientCnxn.java:1214)
    [junit] Running org.apache.zookeeper.test.ReconfigTest in thread 4
    [junit] Tests run: 1, Failures: 0, Errors: 1, Skipped: 0, Time elapsed: 0 sec, Thread:
4, Class: org.apache.zookeeper.test.ReconfigTest
    [junit] Test org.apache.zookeeper.test.ReconfigTest FAILED (timeout)

fail.build.on.test.failure:

BUILD FAILED
/home/jenkins/jenkins-slave/workspace/ZooKeeper-trunk-jdk8/build.xml:1219: The following error
occurred while executing this line:
/home/jenkins/jenkins-slave/workspace/ZooKeeper-trunk-jdk8/build.xml:1223: Tests failed!

Total time: 20 minutes 2 seconds
Build step 'Invoke Ant' marked build as failure
[WARNINGS] Skipping publisher since build result is FAILURE
Recording test results
Email was triggered for: Failure - Any
Sending email for trigger: Failure - Any



###################################################################################
############################## FAILED TESTS (if any) ##############################
1 tests failed.
FAILED:  org.apache.zookeeper.test.ReconfigTest.testJMXBeanAfterRoleChange

Error Message:
Timeout occurred. Please note the time in the report does not reflect the time until the timeout.

Stack Trace:
junit.framework.AssertionFailedError: Timeout occurred. Please note the time in the report
does not reflect the time until the timeout.
	at java.lang.Thread.run(Thread.java:745)



Mime
  • Unnamed multipart/mixed (inline, None, 0 bytes)
View raw message