zookeeper-dev mailing list archives

Site index · List index
Message view « Date » · « Thread »
Top « Date » · « Thread »
From Apache Jenkins Server <jenk...@builds.apache.org>
Subject ZooKeeper-trunk - Build # 3318 - Failure
Date Thu, 16 Mar 2017 18:30:05 GMT
See https://builds.apache.org/job/ZooKeeper-trunk/3318/

###################################################################################
########################## LAST 60 LINES OF THE CONSOLE ###########################
[...truncated 70.81 MB...]
    [junit] 2017-03-16 18:29:53,034 [myid:127.0.0.1:19430] - INFO  [main-SendThread(127.0.0.1:19430):ClientCnxn$SendThread@1231]
- channel for sessionid 0x300a511f53e0000 is lost, closing socket connection and attempting
reconnect
    [junit] 2017-03-16 18:29:53,035 [myid:127.0.0.1:19391] - INFO  [main-SendThread(127.0.0.1:19391):ClientCnxn$SendThread@1113]
- Opening socket connection to server 127.0.0.1/127.0.0.1:19391. Will not attempt to authenticate
using SASL (unknown error)
    [junit] 2017-03-16 18:29:53,035 [myid:] - INFO  [New I/O boss #8778:ClientCnxnSocketNetty$1@127]
- future isn't success, cause: {}
    [junit] java.net.ConnectException: Connection refused: 127.0.0.1/127.0.0.1:19391
    [junit] 	at sun.nio.ch.SocketChannelImpl.checkConnect(Native Method)
    [junit] 	at sun.nio.ch.SocketChannelImpl.finishConnect(SocketChannelImpl.java:744)
    [junit] 	at org.jboss.netty.channel.socket.nio.NioClientBoss.connect(NioClientBoss.java:152)
    [junit] 	at org.jboss.netty.channel.socket.nio.NioClientBoss.processSelectedKeys(NioClientBoss.java:105)
    [junit] 	at org.jboss.netty.channel.socket.nio.NioClientBoss.process(NioClientBoss.java:79)
    [junit] 	at org.jboss.netty.channel.socket.nio.AbstractNioSelector.run(AbstractNioSelector.java:337)
    [junit] 	at org.jboss.netty.channel.socket.nio.NioClientBoss.run(NioClientBoss.java:42)
    [junit] 	at org.jboss.netty.util.ThreadRenamingRunnable.run(ThreadRenamingRunnable.java:108)
    [junit] 	at org.jboss.netty.util.internal.DeadLockProofWorker$1.run(DeadLockProofWorker.java:42)
    [junit] 	at java.util.concurrent.ThreadPoolExecutor.runWorker(ThreadPoolExecutor.java:1145)
    [junit] 	at java.util.concurrent.ThreadPoolExecutor$Worker.run(ThreadPoolExecutor.java:615)
    [junit] 	at java.lang.Thread.run(Thread.java:745)
    [junit] 2017-03-16 18:29:53,035 [myid:] - WARN  [New I/O boss #8778:ClientCnxnSocketNetty$ZKClientHandler@439]
- Exception caught: [id: 0x66b2a15e] EXCEPTION: java.net.ConnectException: Connection refused:
127.0.0.1/127.0.0.1:19391
    [junit] java.net.ConnectException: Connection refused: 127.0.0.1/127.0.0.1:19391
    [junit] 	at sun.nio.ch.SocketChannelImpl.checkConnect(Native Method)
    [junit] 	at sun.nio.ch.SocketChannelImpl.finishConnect(SocketChannelImpl.java:744)
    [junit] 	at org.jboss.netty.channel.socket.nio.NioClientBoss.connect(NioClientBoss.java:152)
    [junit] 	at org.jboss.netty.channel.socket.nio.NioClientBoss.processSelectedKeys(NioClientBoss.java:105)
    [junit] 	at org.jboss.netty.channel.socket.nio.NioClientBoss.process(NioClientBoss.java:79)
    [junit] 	at org.jboss.netty.channel.socket.nio.AbstractNioSelector.run(AbstractNioSelector.java:337)
    [junit] 	at org.jboss.netty.channel.socket.nio.NioClientBoss.run(NioClientBoss.java:42)
    [junit] 	at org.jboss.netty.util.ThreadRenamingRunnable.run(ThreadRenamingRunnable.java:108)
    [junit] 	at org.jboss.netty.util.internal.DeadLockProofWorker$1.run(DeadLockProofWorker.java:42)
    [junit] 	at java.util.concurrent.ThreadPoolExecutor.runWorker(ThreadPoolExecutor.java:1145)
    [junit] 	at java.util.concurrent.ThreadPoolExecutor$Worker.run(ThreadPoolExecutor.java:615)
    [junit] 	at java.lang.Thread.run(Thread.java:745)
    [junit] 2017-03-16 18:29:53,035 [myid:] - INFO  [New I/O boss #8778:ClientCnxnSocketNetty@208]
- channel is told closing
    [junit] 2017-03-16 18:29:53,036 [myid:127.0.0.1:19391] - INFO  [main-SendThread(127.0.0.1:19391):ClientCnxn$SendThread@1231]
- channel for sessionid 0x600a50f82360001 is lost, closing socket connection and attempting
reconnect
    [junit] Test org.apache.zookeeper.test.NettyNettySuiteTest FAILED

fail.build.on.test.failure:

BUILD FAILED
/home/jenkins/jenkins-slave/workspace/ZooKeeper-trunk/build.xml:1338: The following error
occurred while executing this line:
/home/jenkins/jenkins-slave/workspace/ZooKeeper-trunk/build.xml:1219: The following error
occurred while executing this line:
/home/jenkins/jenkins-slave/workspace/ZooKeeper-trunk/build.xml:1223: Tests failed!

Total time: 13 minutes 31 seconds
Build step 'Execute shell' marked build as failure
[FINDBUGS] Skipping publisher since build result is FAILURE
[WARNINGS] Skipping publisher since build result is FAILURE
Archiving artifacts
Setting JDK_1_7_LATEST__HOME=/home/jenkins/tools/java/latest1.7
Recording fingerprints
Setting JDK_1_7_LATEST__HOME=/home/jenkins/tools/java/latest1.7
[JIRA] Updating issue ZOOKEEPER-2460
Recording test results
Setting JDK_1_7_LATEST__HOME=/home/jenkins/tools/java/latest1.7
Publishing Javadoc
Setting JDK_1_7_LATEST__HOME=/home/jenkins/tools/java/latest1.7
Setting JDK_1_7_LATEST__HOME=/home/jenkins/tools/java/latest1.7
Email was triggered for: Failure - Any
Sending email for trigger: Failure - Any
Setting JDK_1_7_LATEST__HOME=/home/jenkins/tools/java/latest1.7
Setting JDK_1_7_LATEST__HOME=/home/jenkins/tools/java/latest1.7



###################################################################################
############################## FAILED TESTS (if any) ##############################
1 tests failed.
FAILED:  org.apache.zookeeper.test.ReconfigTest.testQuorumSystemChange

Error Message:
KeeperErrorCode = Session expired

Stack Trace:
org.apache.zookeeper.KeeperException$SessionExpiredException: KeeperErrorCode = Session expired
	at org.apache.zookeeper.KeeperException.create(KeeperException.java:131)
	at org.apache.zookeeper.KeeperException.create(KeeperException.java:51)
	at org.apache.zookeeper.admin.ZooKeeperAdmin.reconfigure(ZooKeeperAdmin.java:183)
	at org.apache.zookeeper.admin.ZooKeeperAdmin.reconfigure(ZooKeeperAdmin.java:200)
	at org.apache.zookeeper.test.ReconfigTest.reconfig(ReconfigTest.java:84)
	at org.apache.zookeeper.test.ReconfigTest.testQuorumSystemChange(ReconfigTest.java:871)
	at org.apache.zookeeper.JUnit4ZKTestRunner$LoggedInvokeMethod.evaluate(JUnit4ZKTestRunner.java:79)



Mime
  • Unnamed multipart/mixed (inline, None, 0 bytes)
View raw message