zookeeper-dev mailing list archives

Site index · List index
Message view « Date » · « Thread »
Top « Date » · « Thread »
From Apache Jenkins Server <jenk...@builds.apache.org>
Subject ZooKeeper_branch35_openjdk7 - Build # 457 - Still Failing
Date Thu, 16 Mar 2017 22:59:09 GMT
See https://builds.apache.org/job/ZooKeeper_branch35_openjdk7/457/

###################################################################################
########################## LAST 60 LINES OF THE CONSOLE ###########################
[...truncated 69.10 MB...]
    [junit] 2017-03-16 22:58:48,742 [myid:127.0.0.1:19301] - INFO  [main-SendThread(127.0.0.1:19301):ClientCnxn$SendThread@1113]
- Opening socket connection to server 127.0.0.1/127.0.0.1:19301. Will not attempt to authenticate
using SASL (unknown error)
    [junit] 2017-03-16 22:58:48,743 [myid:127.0.0.1:19301] - WARN  [main-SendThread(127.0.0.1:19301):ClientCnxn$SendThread@1235]
- Session 0x477397f80000 for server 127.0.0.1/127.0.0.1:19301, unexpected error, closing socket
connection and attempting reconnect
    [junit] java.net.ConnectException: Connection refused
    [junit] 	at sun.nio.ch.SocketChannelImpl.checkConnect(Native Method)
    [junit] 	at sun.nio.ch.SocketChannelImpl.finishConnect(SocketChannelImpl.java:739)
    [junit] 	at org.apache.zookeeper.ClientCnxnSocketNIO.doTransport(ClientCnxnSocketNIO.java:357)
    [junit] 	at org.apache.zookeeper.ClientCnxn$SendThread.run(ClientCnxn.java:1214)
    [junit] 2017-03-16 22:58:49,594 [myid:127.0.0.1:19313] - WARN  [main-SendThread(127.0.0.1:19313):ClientCnxn$SendThread@1181]
- Client session timed out, have not heard from server in 30027ms for sessionid 0x40047746cda0000
    [junit] 2017-03-16 22:58:49,594 [myid:127.0.0.1:19313] - INFO  [main-SendThread(127.0.0.1:19313):ClientCnxn$SendThread@1229]
- Client session timed out, have not heard from server in 30027ms for sessionid 0x40047746cda0000,
closing socket connection and attempting reconnect
    [junit] 2017-03-16 22:58:49,930 [myid:127.0.0.1:19304] - INFO  [main-SendThread(127.0.0.1:19304):ClientCnxn$SendThread@1113]
- Opening socket connection to server 127.0.0.1/127.0.0.1:19304. Will not attempt to authenticate
using SASL (unknown error)
    [junit] 2017-03-16 22:58:49,931 [myid:127.0.0.1:19304] - WARN  [main-SendThread(127.0.0.1:19304):ClientCnxn$SendThread@1235]
- Session 0x10047739b510001 for server 127.0.0.1/127.0.0.1:19304, unexpected error, closing
socket connection and attempting reconnect
    [junit] java.net.ConnectException: Connection refused
    [junit] 	at sun.nio.ch.SocketChannelImpl.checkConnect(Native Method)
    [junit] 	at sun.nio.ch.SocketChannelImpl.finishConnect(SocketChannelImpl.java:739)
    [junit] 	at org.apache.zookeeper.ClientCnxnSocketNIO.doTransport(ClientCnxnSocketNIO.java:357)
    [junit] 	at org.apache.zookeeper.ClientCnxn$SendThread.run(ClientCnxn.java:1214)
    [junit] 2017-03-16 22:58:50,055 [myid:127.0.0.1:19301] - INFO  [main-SendThread(127.0.0.1:19301):ClientCnxn$SendThread@1113]
- Opening socket connection to server 127.0.0.1/127.0.0.1:19301. Will not attempt to authenticate
using SASL (unknown error)
    [junit] 2017-03-16 22:58:50,056 [myid:127.0.0.1:19301] - WARN  [main-SendThread(127.0.0.1:19301):ClientCnxn$SendThread@1235]
- Session 0x477397f80001 for server 127.0.0.1/127.0.0.1:19301, unexpected error, closing socket
connection and attempting reconnect
    [junit] java.net.ConnectException: Connection refused
    [junit] 	at sun.nio.ch.SocketChannelImpl.checkConnect(Native Method)
    [junit] 	at sun.nio.ch.SocketChannelImpl.finishConnect(SocketChannelImpl.java:739)
    [junit] 	at org.apache.zookeeper.ClientCnxnSocketNIO.doTransport(ClientCnxnSocketNIO.java:357)
    [junit] 	at org.apache.zookeeper.ClientCnxn$SendThread.run(ClientCnxn.java:1214)
    [junit] 2017-03-16 22:58:50,261 [myid:127.0.0.1:19304] - INFO  [main-SendThread(127.0.0.1:19304):ClientCnxn$SendThread@1113]
- Opening socket connection to server 127.0.0.1/127.0.0.1:19304. Will not attempt to authenticate
using SASL (unknown error)
    [junit] 2017-03-16 22:58:50,262 [myid:127.0.0.1:19304] - WARN  [main-SendThread(127.0.0.1:19304):ClientCnxn$SendThread@1235]
- Session 0x10047739b510000 for server 127.0.0.1/127.0.0.1:19304, unexpected error, closing
socket connection and attempting reconnect
    [junit] java.net.ConnectException: Connection refused
    [junit] 	at sun.nio.ch.SocketChannelImpl.checkConnect(Native Method)
    [junit] 	at sun.nio.ch.SocketChannelImpl.finishConnect(SocketChannelImpl.java:739)
    [junit] 	at org.apache.zookeeper.ClientCnxnSocketNIO.doTransport(ClientCnxnSocketNIO.java:357)
    [junit] 	at org.apache.zookeeper.ClientCnxn$SendThread.run(ClientCnxn.java:1214)
    [junit] 2017-03-16 22:58:50,478 [myid:127.0.0.1:19301] - INFO  [main-SendThread(127.0.0.1:19301):ClientCnxn$SendThread@1113]
- Opening socket connection to server 127.0.0.1/127.0.0.1:19301. Will not attempt to authenticate
using SASL (unknown error)
    [junit] 2017-03-16 22:58:50,479 [myid:127.0.0.1:19301] - WARN  [main-SendThread(127.0.0.1:19301):ClientCnxn$SendThread@1235]
- Session 0x477397f80000 for server 127.0.0.1/127.0.0.1:19301, unexpected error, closing socket
connection and attempting reconnect
    [junit] java.net.ConnectException: Connection refused
    [junit] 	at sun.nio.ch.SocketChannelImpl.checkConnect(Native Method)
    [junit] 	at sun.nio.ch.SocketChannelImpl.finishConnect(SocketChannelImpl.java:739)
    [junit] 	at org.apache.zookeeper.ClientCnxnSocketNIO.doTransport(ClientCnxnSocketNIO.java:357)
    [junit] 	at org.apache.zookeeper.ClientCnxn$SendThread.run(ClientCnxn.java:1214)
    [junit] 2017-03-16 22:58:51,112 [myid:127.0.0.1:19304] - INFO  [main-SendThread(127.0.0.1:19304):ClientCnxn$SendThread@1113]
- Opening socket connection to server 127.0.0.1/127.0.0.1:19304. Will not attempt to authenticate
using SASL (unknown error)
    [junit] 2017-03-16 22:58:51,113 [myid:127.0.0.1:19304] - WARN  [main-SendThread(127.0.0.1:19304):ClientCnxn$SendThread@1235]
- Session 0x10047739b510001 for server 127.0.0.1/127.0.0.1:19304, unexpected error, closing
socket connection and attempting reconnect
    [junit] java.net.ConnectException: Connection refused
    [junit] 	at sun.nio.ch.SocketChannelImpl.checkConnect(Native Method)
    [junit] 	at sun.nio.ch.SocketChannelImpl.finishConnect(SocketChannelImpl.java:739)
    [junit] 	at org.apache.zookeeper.ClientCnxnSocketNIO.doTransport(ClientCnxnSocketNIO.java:357)
    [junit] 	at org.apache.zookeeper.ClientCnxn$SendThread.run(ClientCnxn.java:1214)
    [junit] Running org.apache.zookeeper.server.quorum.StandaloneDisabledTest in thread 4
    [junit] Tests run: 1, Failures: 0, Errors: 1, Skipped: 0, Time elapsed: 0 sec, Thread:
4, Class: org.apache.zookeeper.server.quorum.StandaloneDisabledTest
    [junit] Test org.apache.zookeeper.server.quorum.StandaloneDisabledTest FAILED (timeout)

fail.build.on.test.failure:

BUILD FAILED
/home/jenkins/jenkins-slave/workspace/ZooKeeper_branch35_openjdk7/build.xml:1219: The following
error occurred while executing this line:
/home/jenkins/jenkins-slave/workspace/ZooKeeper_branch35_openjdk7/build.xml:1223: Tests failed!

Total time: 16 minutes 40 seconds
Build step 'Invoke Ant' marked build as failure
Recording test results
Email was triggered for: Failure - Any
Sending email for trigger: Failure - Any



###################################################################################
############################## FAILED TESTS (if any) ##############################
3 tests failed.
FAILED:  org.apache.zookeeper.server.quorum.StandaloneDisabledTest.startSingleServerTest

Error Message:
Timeout occurred. Please note the time in the report does not reflect the time until the timeout.

Stack Trace:
junit.framework.AssertionFailedError: Timeout occurred. Please note the time in the report
does not reflect the time until the timeout.
	at java.lang.Thread.run(Thread.java:745)


FAILED:  org.apache.zookeeper.test.ReconfigTest.testPortChange

Error Message:
null

Stack Trace:
junit.framework.AssertionFailedError
	at org.apache.zookeeper.test.ReconfigTest.testPortChange(ReconfigTest.java:681)
	at org.apache.zookeeper.JUnit4ZKTestRunner$LoggedInvokeMethod.evaluate(JUnit4ZKTestRunner.java:79)


FAILED:  org.apache.zookeeper.test.ReconfigTest.testPortChange

Error Message:
null

Stack Trace:
junit.framework.AssertionFailedError
	at org.apache.zookeeper.test.ReconfigTest.testPortChange(ReconfigTest.java:681)
	at org.apache.zookeeper.JUnit4ZKTestRunner$LoggedInvokeMethod.evaluate(JUnit4ZKTestRunner.java:79)



Mime
  • Unnamed multipart/mixed (inline, None, 0 bytes)
View raw message