zookeeper-dev mailing list archives

Site index · List index
Message view « Date » · « Thread »
Top « Date » · « Thread »
From Apache Jenkins Server <jenk...@builds.apache.org>
Subject ZooKeeper_branch35_openjdk7 - Build # 443 - Still Failing
Date Wed, 08 Mar 2017 10:27:06 GMT
See https://builds.apache.org/job/ZooKeeper_branch35_openjdk7/443/

###################################################################################
########################## LAST 60 LINES OF THE CONSOLE ###########################
[...truncated 67.70 MB...]
    [junit] 	at org.apache.zookeeper.ClientCnxnSocketNIO.doTransport(ClientCnxnSocketNIO.java:357)
    [junit] 	at org.apache.zookeeper.ClientCnxn$SendThread.run(ClientCnxn.java:1214)
    [junit] 2017-03-08 10:26:05,990 [myid:127.0.0.1:11315] - INFO  [main-SendThread(127.0.0.1:11315):ClientCnxn$SendThread@1113]
- Opening socket connection to server 127.0.0.1/127.0.0.1:11315. Will not attempt to authenticate
using SASL (unknown error)
    [junit] 2017-03-08 10:26:05,990 [myid:127.0.0.1:11315] - WARN  [main-SendThread(127.0.0.1:11315):ClientCnxn$SendThread@1235]
- Session 0x7007388b9a70000 for server 127.0.0.1/127.0.0.1:11315, unexpected error, closing
socket connection and attempting reconnect
    [junit] java.net.ConnectException: Connection refused
    [junit] 	at sun.nio.ch.SocketChannelImpl.checkConnect(Native Method)
    [junit] 	at sun.nio.ch.SocketChannelImpl.finishConnect(SocketChannelImpl.java:739)
    [junit] 	at org.apache.zookeeper.ClientCnxnSocketNIO.doTransport(ClientCnxnSocketNIO.java:357)
    [junit] 	at org.apache.zookeeper.ClientCnxn$SendThread.run(ClientCnxn.java:1214)
    [junit] 2017-03-08 10:26:06,005 [myid:127.0.0.1:11303] - INFO  [main-SendThread(127.0.0.1:11303):ClientCnxn$SendThread@1113]
- Opening socket connection to server 127.0.0.1/127.0.0.1:11303. Will not attempt to authenticate
using SASL (unknown error)
    [junit] 2017-03-08 10:26:06,005 [myid:127.0.0.1:11303] - WARN  [main-SendThread(127.0.0.1:11303):ClientCnxn$SendThread@1235]
- Session 0x3007388b9030000 for server 127.0.0.1/127.0.0.1:11303, unexpected error, closing
socket connection and attempting reconnect
    [junit] java.net.ConnectException: Connection refused
    [junit] 	at sun.nio.ch.SocketChannelImpl.checkConnect(Native Method)
    [junit] 	at sun.nio.ch.SocketChannelImpl.finishConnect(SocketChannelImpl.java:739)
    [junit] 	at org.apache.zookeeper.ClientCnxnSocketNIO.doTransport(ClientCnxnSocketNIO.java:357)
    [junit] 	at org.apache.zookeeper.ClientCnxn$SendThread.run(ClientCnxn.java:1214)
    [junit] 2017-03-08 10:26:06,093 [myid:127.0.0.1:11309] - INFO  [main-SendThread(127.0.0.1:11309):ClientCnxn$SendThread@1113]
- Opening socket connection to server 127.0.0.1/127.0.0.1:11309. Will not attempt to authenticate
using SASL (unknown error)
    [junit] 2017-03-08 10:26:06,094 [myid:127.0.0.1:11309] - WARN  [main-SendThread(127.0.0.1:11309):ClientCnxn$SendThread@1235]
- Session 0x5007388c2ea0001 for server 127.0.0.1/127.0.0.1:11309, unexpected error, closing
socket connection and attempting reconnect
    [junit] java.net.ConnectException: Connection refused
    [junit] 	at sun.nio.ch.SocketChannelImpl.checkConnect(Native Method)
    [junit] 	at sun.nio.ch.SocketChannelImpl.finishConnect(SocketChannelImpl.java:739)
    [junit] 	at org.apache.zookeeper.ClientCnxnSocketNIO.doTransport(ClientCnxnSocketNIO.java:357)
    [junit] 	at org.apache.zookeeper.ClientCnxn$SendThread.run(ClientCnxn.java:1214)
    [junit] 2017-03-08 10:26:06,320 [myid:127.0.0.1:11297] - INFO  [main-SendThread(127.0.0.1:11297):ClientCnxn$SendThread@1113]
- Opening socket connection to server 127.0.0.1/127.0.0.1:11297. Will not attempt to authenticate
using SASL (unknown error)
    [junit] 2017-03-08 10:26:06,321 [myid:127.0.0.1:11297] - WARN  [main-SendThread(127.0.0.1:11297):ClientCnxn$SendThread@1235]
- Session 0x1007388b9030000 for server 127.0.0.1/127.0.0.1:11297, unexpected error, closing
socket connection and attempting reconnect
    [junit] java.net.ConnectException: Connection refused
    [junit] 	at sun.nio.ch.SocketChannelImpl.checkConnect(Native Method)
    [junit] 	at sun.nio.ch.SocketChannelImpl.finishConnect(SocketChannelImpl.java:739)
    [junit] 	at org.apache.zookeeper.ClientCnxnSocketNIO.doTransport(ClientCnxnSocketNIO.java:357)
    [junit] 	at org.apache.zookeeper.ClientCnxn$SendThread.run(ClientCnxn.java:1214)
    [junit] 2017-03-08 10:26:06,457 [myid:127.0.0.1:11345] - INFO  [main-SendThread(127.0.0.1:11345):ClientCnxn$SendThread@1113]
- Opening socket connection to server 127.0.0.1/127.0.0.1:11345. Will not attempt to authenticate
using SASL (unknown error)
    [junit] 2017-03-08 10:26:06,458 [myid:127.0.0.1:11345] - WARN  [main-SendThread(127.0.0.1:11345):ClientCnxn$SendThread@1235]
- Session 0x100738be02e0000 for server 127.0.0.1/127.0.0.1:11345, unexpected error, closing
socket connection and attempting reconnect
    [junit] java.net.ConnectException: Connection refused
    [junit] 	at sun.nio.ch.SocketChannelImpl.checkConnect(Native Method)
    [junit] 	at sun.nio.ch.SocketChannelImpl.finishConnect(SocketChannelImpl.java:739)
    [junit] 	at org.apache.zookeeper.ClientCnxnSocketNIO.doTransport(ClientCnxnSocketNIO.java:357)
    [junit] 	at org.apache.zookeeper.ClientCnxn$SendThread.run(ClientCnxn.java:1214)
    [junit] 2017-03-08 10:26:06,559 [myid:127.0.0.1:11306] - INFO  [main-SendThread(127.0.0.1:11306):ClientCnxn$SendThread@1113]
- Opening socket connection to server 127.0.0.1/127.0.0.1:11306. Will not attempt to authenticate
using SASL (unknown error)
    [junit] 2017-03-08 10:26:06,560 [myid:127.0.0.1:11306] - WARN  [main-SendThread(127.0.0.1:11306):ClientCnxn$SendThread@1235]
- Session 0x4007388b9060001 for server 127.0.0.1/127.0.0.1:11306, unexpected error, closing
socket connection and attempting reconnect
    [junit] java.net.ConnectException: Connection refused
    [junit] 	at sun.nio.ch.SocketChannelImpl.checkConnect(Native Method)
    [junit] 	at sun.nio.ch.SocketChannelImpl.finishConnect(SocketChannelImpl.java:739)
    [junit] 	at org.apache.zookeeper.ClientCnxnSocketNIO.doTransport(ClientCnxnSocketNIO.java:357)
    [junit] 	at org.apache.zookeeper.ClientCnxn$SendThread.run(ClientCnxn.java:1214)
    [junit] Running org.apache.zookeeper.test.NioNettySuiteTest in thread 1
    [junit] Tests run: 1, Failures: 0, Errors: 1, Skipped: 0, Time elapsed: 0 sec, Thread:
1, Class: org.apache.zookeeper.test.NioNettySuiteTest
    [junit] Test org.apache.zookeeper.test.NioNettySuiteTest FAILED (timeout)

fail.build.on.test.failure:

BUILD FAILED
/home/jenkins/jenkins-slave/workspace/ZooKeeper_branch35_openjdk7/build.xml:1212: The following
error occurred while executing this line:
/home/jenkins/jenkins-slave/workspace/ZooKeeper_branch35_openjdk7/build.xml:1216: Tests failed!

Total time: 21 minutes 43 seconds
Build step 'Invoke Ant' marked build as failure
Recording test results
Email was triggered for: Failure - Any
Sending email for trigger: Failure - Any



###################################################################################
############################## FAILED TESTS (if any) ##############################
10 tests failed.
FAILED:  org.apache.zookeeper.server.quorum.QuorumRequestPipelineTest.testSync[1]

Error Message:
null

Stack Trace:
java.lang.NullPointerException
	at org.apache.zookeeper.server.quorum.QuorumRequestPipelineTest.tearDown(QuorumRequestPipelineTest.java:81)


FAILED:  org.apache.zookeeper.server.quorum.ReconfigDuringLeaderSyncTest.testDuringLeaderSync

Error Message:
zoo.cfg.dynamic.next is not deleted.

Stack Trace:
junit.framework.AssertionFailedError: zoo.cfg.dynamic.next is not deleted.
	at org.apache.zookeeper.server.quorum.ReconfigDuringLeaderSyncTest.testDuringLeaderSync(ReconfigDuringLeaderSyncTest.java:165)
	at org.apache.zookeeper.JUnit4ZKTestRunner$LoggedInvokeMethod.evaluate(JUnit4ZKTestRunner.java:79)


FAILED:  org.apache.zookeeper.server.quorum.ReconfigRecoveryTest.testCurrentServersAreObserversInNextConfig

Error Message:
waiting for server 3 being up

Stack Trace:
junit.framework.AssertionFailedError: waiting for server 3 being up
	at org.apache.zookeeper.server.quorum.ReconfigRecoveryTest.testCurrentServersAreObserversInNextConfig(ReconfigRecoveryTest.java:217)
	at org.apache.zookeeper.JUnit4ZKTestRunner$LoggedInvokeMethod.evaluate(JUnit4ZKTestRunner.java:79)


FAILED:  org.apache.zookeeper.test.DuplicateLocalSessionUpgradeTest.testLocalSessionUpgradeOnLeader

Error Message:
waiting for server up

Stack Trace:
junit.framework.AssertionFailedError: waiting for server up
	at org.apache.zookeeper.test.QuorumBase.startServers(QuorumBase.java:223)
	at org.apache.zookeeper.test.QuorumBase.setUp(QuorumBase.java:120)
	at org.apache.zookeeper.test.QuorumBase.setUp(QuorumBase.java:78)
	at org.apache.zookeeper.test.DuplicateLocalSessionUpgradeTest.setUp(DuplicateLocalSessionUpgradeTest.java:53)


FAILED:  org.apache.zookeeper.test.ReconfigTest.testQuorumSystemChange

Error Message:
KeeperErrorCode = Session expired

Stack Trace:
org.apache.zookeeper.KeeperException$SessionExpiredException: KeeperErrorCode = Session expired
	at org.apache.zookeeper.KeeperException.create(KeeperException.java:131)
	at org.apache.zookeeper.KeeperException.create(KeeperException.java:51)
	at org.apache.zookeeper.ZooKeeper.internalReconfig(ZooKeeper.java:2917)
	at org.apache.zookeeper.ZooKeeper.internalReconfig(ZooKeeper.java:2926)
	at org.apache.zookeeper.admin.ZooKeeperAdmin.reconfigure(ZooKeeperAdmin.java:182)
	at org.apache.zookeeper.test.ReconfigTest.reconfig(ReconfigTest.java:84)
	at org.apache.zookeeper.test.ReconfigTest.testQuorumSystemChange(ReconfigTest.java:871)
	at org.apache.zookeeper.JUnit4ZKTestRunner$LoggedInvokeMethod.evaluate(JUnit4ZKTestRunner.java:79)


FAILED:  org.apache.zookeeper.test.WatcherTest.testWatcherAutoResetWithLocal

Error Message:
Failed to connect to ZooKeeper server.

Stack Trace:
java.util.concurrent.TimeoutException: Failed to connect to ZooKeeper server.
	at org.apache.zookeeper.test.ClientBase$CountdownWatcher.waitForConnected(ClientBase.java:132)
	at org.apache.zookeeper.test.WatcherTest.testWatcherAutoReset(WatcherTest.java:297)
	at org.apache.zookeeper.test.WatcherTest.testWatcherAutoResetWithLocal(WatcherTest.java:254)
	at org.apache.zookeeper.JUnit4ZKTestRunner$LoggedInvokeMethod.evaluate(JUnit4ZKTestRunner.java:79)


FAILED:  org.apache.zookeeper.test.AsyncHammerTest.testHammer

Error Message:
waiting for server up

Stack Trace:
junit.framework.AssertionFailedError: waiting for server up
	at org.apache.zookeeper.test.QuorumBase.startServers(QuorumBase.java:223)
	at org.apache.zookeeper.test.QuorumBase.setUp(QuorumBase.java:120)
	at org.apache.zookeeper.test.AsyncHammerTest.setUp(AsyncHammerTest.java:52)
	at org.apache.zookeeper.test.AsyncHammerTest.testHammer(AsyncHammerTest.java:171)
	at org.apache.zookeeper.JUnit4ZKTestRunner$LoggedInvokeMethod.evaluate(JUnit4ZKTestRunner.java:79)


FAILED:  org.apache.zookeeper.test.NioNettySuiteTest.testWatcherAutoResetWithLocal

Error Message:
Timeout occurred. Please note the time in the report does not reflect the time until the timeout.

Stack Trace:
junit.framework.AssertionFailedError: Timeout occurred. Please note the time in the report
does not reflect the time until the timeout.
	at java.lang.Thread.run(Thread.java:745)


FAILED:  org.apache.zookeeper.test.SessionUpgradeTest.testUpgradeWithEphemeralOnLeader

Error Message:
waiting for server up

Stack Trace:
junit.framework.AssertionFailedError: waiting for server up
	at org.apache.zookeeper.test.QuorumBase.startServers(QuorumBase.java:223)
	at org.apache.zookeeper.test.QuorumBase.setUp(QuorumBase.java:120)
	at org.apache.zookeeper.test.QuorumBase.setUp(QuorumBase.java:78)
	at org.apache.zookeeper.test.SessionUpgradeTest.setUp(SessionUpgradeTest.java:52)


FAILED:  org.apache.zookeeper.test.ZkDatabaseCorruptionTest.testCorruption

Error Message:
waiting for server up

Stack Trace:
junit.framework.AssertionFailedError: waiting for server up
	at org.apache.zookeeper.test.QuorumBase.startServers(QuorumBase.java:223)
	at org.apache.zookeeper.test.QuorumBase.setUp(QuorumBase.java:120)
	at org.apache.zookeeper.test.QuorumBase.setUp(QuorumBase.java:78)
	at org.apache.zookeeper.test.ZkDatabaseCorruptionTest.setUp(ZkDatabaseCorruptionTest.java:51)



Mime
  • Unnamed multipart/mixed (inline, None, 0 bytes)
View raw message