zookeeper-dev mailing list archives

Site index · List index
Message view « Date » · « Thread »
Top « Date » · « Thread »
From Apache Jenkins Server <jenk...@builds.apache.org>
Subject ZooKeeper_branch34_openjdk7 - Build # 1432 - Still Failing
Date Fri, 17 Mar 2017 15:21:18 GMT
See https://builds.apache.org/job/ZooKeeper_branch34_openjdk7/1432/

###################################################################################
########################## LAST 60 LINES OF THE CONSOLE ###########################
[...truncated 30.24 MB...]
    [junit] 2017-03-17 15:21:14,594 [myid:] - INFO  [main:SessionTrackerImpl@225] - Shutting
down
    [junit] 2017-03-17 15:21:14,594 [myid:] - INFO  [main:PrepRequestProcessor@764] - Shutting
down
    [junit] 2017-03-17 15:21:14,594 [myid:] - INFO  [main:SyncRequestProcessor@208] - Shutting
down
    [junit] 2017-03-17 15:21:14,595 [myid:] - INFO  [ProcessThread(sid:0 cport:11221)::PrepRequestProcessor@143]
- PrepRequestProcessor exited loop!
    [junit] 2017-03-17 15:21:14,595 [myid:] - INFO  [SyncThread:0:SyncRequestProcessor@186]
- SyncRequestProcessor exited!
    [junit] 2017-03-17 15:21:14,595 [myid:] - INFO  [main:FinalRequestProcessor@402] - shutdown
of request processor complete
    [junit] 2017-03-17 15:21:14,595 [myid:] - INFO  [main:FourLetterWordMain@62] - connecting
to 127.0.0.1 11221
    [junit] 2017-03-17 15:21:14,596 [myid:] - INFO  [main:JMXEnv@147] - ensureOnly:[]
    [junit] 2017-03-17 15:21:14,597 [myid:] - INFO  [main:ClientBase@445] - STARTING server
    [junit] 2017-03-17 15:21:14,597 [myid:] - INFO  [main:ClientBase@366] - CREATING server
instance 127.0.0.1:11221
    [junit] 2017-03-17 15:21:14,597 [myid:] - INFO  [main:NIOServerCnxnFactory@89] - binding
to port 0.0.0.0/0.0.0.0:11221
    [junit] 2017-03-17 15:21:14,598 [myid:] - INFO  [main:ClientBase@341] - STARTING server
instance 127.0.0.1:11221
    [junit] 2017-03-17 15:21:14,598 [myid:] - INFO  [main:ZooKeeperServer@173] - Created server
with tickTime 3000 minSessionTimeout 6000 maxSessionTimeout 60000 datadir /home/jenkins/jenkins-slave/workspace/ZooKeeper_branch34_openjdk7/build/test/tmp/test1983158256101735144.junit.dir/version-2
snapdir /home/jenkins/jenkins-slave/workspace/ZooKeeper_branch34_openjdk7/build/test/tmp/test1983158256101735144.junit.dir/version-2
    [junit] 2017-03-17 15:21:14,601 [myid:] - ERROR [main:ZooKeeperServer@472] - ZKShutdownHandler
is not registered, so ZooKeeper server won't take any action on ERROR or SHUTDOWN server state
changes
    [junit] 2017-03-17 15:21:14,601 [myid:] - INFO  [main:FourLetterWordMain@62] - connecting
to 127.0.0.1 11221
    [junit] 2017-03-17 15:21:14,602 [myid:] - INFO  [NIOServerCxn.Factory:0.0.0.0/0.0.0.0:11221:NIOServerCnxnFactory@192]
- Accepted socket connection from /127.0.0.1:52747
    [junit] 2017-03-17 15:21:14,602 [myid:] - INFO  [NIOServerCxn.Factory:0.0.0.0/0.0.0.0:11221:NIOServerCnxn@883]
- Processing stat command from /127.0.0.1:52747
    [junit] 2017-03-17 15:21:14,603 [myid:] - INFO  [Thread-4:NIOServerCnxn$StatCommand@674]
- Stat command output
    [junit] 2017-03-17 15:21:14,603 [myid:] - INFO  [Thread-4:NIOServerCnxn@1044] - Closed
socket connection for client /127.0.0.1:52747 (no session established for client)
    [junit] 2017-03-17 15:21:14,603 [myid:] - INFO  [main:JMXEnv@230] - ensureParent:[InMemoryDataTree,
StandaloneServer_port]
    [junit] 2017-03-17 15:21:14,605 [myid:] - INFO  [main:JMXEnv@247] - expect:InMemoryDataTree
    [junit] 2017-03-17 15:21:14,605 [myid:] - INFO  [main:JMXEnv@251] - found:InMemoryDataTree
org.apache.ZooKeeperService:name0=StandaloneServer_port11221,name1=InMemoryDataTree
    [junit] 2017-03-17 15:21:14,605 [myid:] - INFO  [main:JMXEnv@247] - expect:StandaloneServer_port
    [junit] 2017-03-17 15:21:14,605 [myid:] - INFO  [main:JMXEnv@251] - found:StandaloneServer_port
org.apache.ZooKeeperService:name0=StandaloneServer_port11221
    [junit] 2017-03-17 15:21:14,605 [myid:] - INFO  [main:JUnit4ZKTestRunner$LoggedInvokeMethod@58]
- Memory used 35724
    [junit] 2017-03-17 15:21:14,606 [myid:] - INFO  [main:JUnit4ZKTestRunner$LoggedInvokeMethod@63]
- Number of threads 20
    [junit] 2017-03-17 15:21:14,606 [myid:] - INFO  [main:JUnit4ZKTestRunner$LoggedInvokeMethod@78]
- FINISHED TEST METHOD testQuota
    [junit] 2017-03-17 15:21:14,606 [myid:] - INFO  [main:ClientBase@522] - tearDown starting
    [junit] 2017-03-17 15:21:14,680 [myid:] - INFO  [main:ZooKeeper@684] - Session: 0x15adcdbc3720000
closed
    [junit] 2017-03-17 15:21:14,680 [myid:] - INFO  [main:ClientBase@492] - STOPPING server
    [junit] 2017-03-17 15:21:14,681 [myid:] - INFO  [main-EventThread:ClientCnxn$EventThread@519]
- EventThread shut down for session: 0x15adcdbc3720000
    [junit] 2017-03-17 15:21:14,681 [myid:] - INFO  [NIOServerCxn.Factory:0.0.0.0/0.0.0.0:11221:NIOServerCnxnFactory@219]
- NIOServerCnxn factory exited run method
    [junit] 2017-03-17 15:21:14,681 [myid:] - INFO  [main:ZooKeeperServer@505] - shutting
down
    [junit] 2017-03-17 15:21:14,681 [myid:] - ERROR [main:ZooKeeperServer@472] - ZKShutdownHandler
is not registered, so ZooKeeper server won't take any action on ERROR or SHUTDOWN server state
changes
    [junit] 2017-03-17 15:21:14,681 [myid:] - INFO  [main:SessionTrackerImpl@225] - Shutting
down
    [junit] 2017-03-17 15:21:14,681 [myid:] - INFO  [main:PrepRequestProcessor@764] - Shutting
down
    [junit] 2017-03-17 15:21:14,682 [myid:] - INFO  [main:SyncRequestProcessor@208] - Shutting
down
    [junit] 2017-03-17 15:21:14,682 [myid:] - INFO  [ProcessThread(sid:0 cport:11221)::PrepRequestProcessor@143]
- PrepRequestProcessor exited loop!
    [junit] 2017-03-17 15:21:14,682 [myid:] - INFO  [SyncThread:0:SyncRequestProcessor@186]
- SyncRequestProcessor exited!
    [junit] 2017-03-17 15:21:14,682 [myid:] - INFO  [main:FinalRequestProcessor@402] - shutdown
of request processor complete
    [junit] 2017-03-17 15:21:14,683 [myid:] - INFO  [main:FourLetterWordMain@62] - connecting
to 127.0.0.1 11221
    [junit] 2017-03-17 15:21:14,683 [myid:] - INFO  [main:JMXEnv@147] - ensureOnly:[]
    [junit] 2017-03-17 15:21:14,687 [myid:] - INFO  [main:ClientBase@547] - fdcount after
test is: 97 at start it was 85
    [junit] 2017-03-17 15:21:14,687 [myid:] - INFO  [main:ClientBase@549] - sleeping for 20
secs
    [junit] 2017-03-17 15:21:14,688 [myid:] - INFO  [main:ZKTestCase$1@69] - SUCCEEDED testQuota
    [junit] 2017-03-17 15:21:14,688 [myid:] - INFO  [main:ZKTestCase$1@64] - FINISHED testQuota
    [junit] Tests run: 1, Failures: 0, Errors: 0, Skipped: 0, Time elapsed: 0.769 sec

fail.build.on.test.failure:

BUILD FAILED
/home/jenkins/jenkins-slave/workspace/ZooKeeper_branch34_openjdk7/build.xml:1329: The following
error occurred while executing this line:
/home/jenkins/jenkins-slave/workspace/ZooKeeper_branch34_openjdk7/build.xml:1332: Tests failed!

Total time: 38 minutes 2 seconds
Build step 'Invoke Ant' marked build as failure
Recording test results
Email was triggered for: Failure - Any
Sending email for trigger: Failure - Any



###################################################################################
############################## FAILED TESTS (if any) ##############################
3 tests failed.
FAILED:  org.apache.zookeeper.server.quorum.auth.QuorumKerberosAuthTest.testValidCredentials

Error Message:
waiting for server 0 being up

Stack Trace:
junit.framework.AssertionFailedError: waiting for server 0 being up
	at org.apache.zookeeper.server.quorum.auth.QuorumAuthTestBase.startQuorum(QuorumAuthTestBase.java:74)
	at org.apache.zookeeper.server.quorum.auth.QuorumKerberosAuthTest.testValidCredentials(QuorumKerberosAuthTest.java:101)
	at org.apache.zookeeper.JUnit4ZKTestRunner$LoggedInvokeMethod.evaluate(JUnit4ZKTestRunner.java:55)


FAILED:  org.apache.zookeeper.server.quorum.auth.QuorumKerberosHostBasedAuthTest.testValidCredentials

Error Message:
waiting for server 0 being up

Stack Trace:
junit.framework.AssertionFailedError: waiting for server 0 being up
	at org.apache.zookeeper.server.quorum.auth.QuorumAuthTestBase.startQuorum(QuorumAuthTestBase.java:74)
	at org.apache.zookeeper.server.quorum.auth.QuorumKerberosHostBasedAuthTest.testValidCredentials(QuorumKerberosHostBasedAuthTest.java:125)
	at org.apache.zookeeper.JUnit4ZKTestRunner$LoggedInvokeMethod.evaluate(JUnit4ZKTestRunner.java:55)


FAILED:  org.apache.zookeeper.test.QuorumTest.testLeaderShutdown

Error Message:
Forked Java VM exited abnormally. Please note the time in the report does not reflect the
time until the VM exit.

Stack Trace:
junit.framework.AssertionFailedError: Forked Java VM exited abnormally. Please note the time
in the report does not reflect the time until the VM exit.



Mime
  • Unnamed multipart/mixed (inline, None, 0 bytes)
View raw message