zookeeper-dev mailing list archives

Site index · List index
Message view « Date » · « Thread »
Top « Date » · « Thread »
From Apache Jenkins Server <jenk...@builds.apache.org>
Subject Failed: ZOOKEEPER- PreCommit Build #411
Date Tue, 14 Mar 2017 06:27:14 GMT
Build: https://builds.apache.org/job/PreCommit-ZOOKEEPER-github-pr-build/411/

###################################################################################
########################## LAST 60 LINES OF THE CONSOLE ###########################
[...truncated 69.18 MB...]
     [exec]     +1 javadoc.  The javadoc tool did not generate any warning messages.
     [exec] 
     [exec]     +1 javac.  The applied patch does not increase the total number of javac compiler
warnings.
     [exec] 
     [exec]     +1 findbugs.  The patch does not introduce any new Findbugs (version 3.0.1)
warnings.
     [exec] 
     [exec]     -1 release audit.  The applied patch generated 2 release audit warnings (more
than the trunk's current 0 warnings).
     [exec] 
     [exec]     -1 core tests.  The patch failed core unit tests.
     [exec] 
     [exec]     +1 contrib tests.  The patch passed contrib unit tests.
     [exec] 
     [exec] Test results: https://builds.apache.org/job/PreCommit-ZOOKEEPER-github-pr-build/411//testReport/
     [exec] Release audit warnings: https://builds.apache.org/job/PreCommit-ZOOKEEPER-github-pr-build/411//artifact/trunk/patchprocess/patchReleaseAuditProblems.txt
     [exec] Findbugs warnings: https://builds.apache.org/job/PreCommit-ZOOKEEPER-github-pr-build/411//artifact/trunk/build/test/findbugs/newPatchFindbugsWarnings.html
     [exec] Console output: https://builds.apache.org/job/PreCommit-ZOOKEEPER-github-pr-build/411//console
     [exec] 
     [exec] This message is automatically generated.
     [exec] 
     [exec] 
     [exec] ======================================================================
     [exec] ======================================================================
     [exec]     Adding comment to Jira.
     [exec] ======================================================================
     [exec] ======================================================================
     [exec] 
     [exec] 
     [exec] Comment added.
     [exec] 5110274e28860d79beed2ebdac9c82bdb0586809 logged out
     [exec] 
     [exec] 
     [exec] ======================================================================
     [exec] ======================================================================
     [exec]     Finished build.
     [exec] ======================================================================
     [exec] ======================================================================
     [exec] 
     [exec] 
     [exec] mv: '/home/jenkins/jenkins-slave/workspace/PreCommit-ZOOKEEPER-github-pr-build/patchprocess'
and '/home/jenkins/jenkins-slave/workspace/PreCommit-ZOOKEEPER-github-pr-build/patchprocess'
are the same file

BUILD FAILED
/home/jenkins/jenkins-slave/workspace/PreCommit-ZOOKEEPER-github-pr-build/build.xml:1634:
exec returned: 2

Total time: 13 minutes 36 seconds
Build step 'Execute shell' marked build as failure
Archiving artifacts
Setting JDK_1_7_LATEST__HOME=/home/jenkins/tools/java/latest1.7
Compressed 591.14 KB of artifacts by 10.8% relative to #408
Recording test results
Setting JDK_1_7_LATEST__HOME=/home/jenkins/tools/java/latest1.7
Setting JDK_1_7_LATEST__HOME=/home/jenkins/tools/java/latest1.7
[description-setter] Description set: ZOOKEEPER-236
Putting comment on the pull request
Setting JDK_1_7_LATEST__HOME=/home/jenkins/tools/java/latest1.7
Email was triggered for: Failure - Any
Sending email for trigger: Failure - Any
Setting JDK_1_7_LATEST__HOME=/home/jenkins/tools/java/latest1.7
Setting JDK_1_7_LATEST__HOME=/home/jenkins/tools/java/latest1.7
Setting JDK_1_7_LATEST__HOME=/home/jenkins/tools/java/latest1.7



###################################################################################
############################## FAILED TESTS (if any) ##############################
1 tests failed.
FAILED:  org.apache.zookeeper.test.SSLTest.testSecureQuorumServer[1]

Error Message:
waiting for server 0 being up

Stack Trace:
junit.framework.AssertionFailedError: waiting for server 0 being up
	at org.apache.zookeeper.test.SSLTest.testSecureQuorumServer(SSLTest.java:155)
	at org.apache.zookeeper.JUnit4ZKTestRunner$LoggedInvokeMethod.evaluate(JUnit4ZKTestRunner.java:79)



Mime
  • Unnamed multipart/mixed (inline, None, 0 bytes)
View raw message