zookeeper-dev mailing list archives

Site index · List index
Message view « Date » · « Thread »
Top « Date » · « Thread »
From Apache Jenkins Server <jenk...@builds.apache.org>
Subject ZooKeeper_branch35_jdk8 - Build # 450 - Still Failing
Date Sun, 12 Mar 2017 12:12:55 GMT
See https://builds.apache.org/job/ZooKeeper_branch35_jdk8/450/

###################################################################################
########################## LAST 60 LINES OF THE CONSOLE ###########################
[...truncated 64.14 MB...]
    [junit] 2017-03-12 12:12:50,728 [myid:] - INFO  [main:ZooKeeperServer@541] - shutting
down
    [junit] 2017-03-12 12:12:50,728 [myid:] - ERROR [main:ZooKeeperServer@505] - ZKShutdownHandler
is not registered, so ZooKeeper server won't take any action on ERROR or SHUTDOWN server state
changes
    [junit] 2017-03-12 12:12:50,728 [myid:] - INFO  [main:SessionTrackerImpl@232] - Shutting
down
    [junit] 2017-03-12 12:12:50,729 [myid:] - INFO  [main:PrepRequestProcessor@973] - Shutting
down
    [junit] 2017-03-12 12:12:50,729 [myid:] - INFO  [main:SyncRequestProcessor@191] - Shutting
down
    [junit] 2017-03-12 12:12:50,729 [myid:] - INFO  [ProcessThread(sid:0 cport:22240)::PrepRequestProcessor@154]
- PrepRequestProcessor exited loop!
    [junit] 2017-03-12 12:12:50,729 [myid:] - INFO  [SyncThread:0:SyncRequestProcessor@169]
- SyncRequestProcessor exited!
    [junit] 2017-03-12 12:12:50,729 [myid:] - INFO  [main:FinalRequestProcessor@479] - shutdown
of request processor complete
    [junit] 2017-03-12 12:12:50,729 [myid:] - INFO  [main:MBeanRegistry@128] - Unregister
MBean [org.apache.ZooKeeperService:name0=StandaloneServer_port22240,name1=InMemoryDataTree]
    [junit] 2017-03-12 12:12:50,746 [myid:] - INFO  [main:MBeanRegistry@128] - Unregister
MBean [org.apache.ZooKeeperService:name0=StandaloneServer_port22240]
    [junit] 2017-03-12 12:12:50,746 [myid:] - INFO  [main:FourLetterWordMain@85] - connecting
to 127.0.0.1 22240
    [junit] 2017-03-12 12:12:50,746 [myid:] - INFO  [main:JMXEnv@146] - ensureOnly:[]
    [junit] 2017-03-12 12:12:50,790 [myid:] - INFO  [main:ClientBase@568] - fdcount after
test is: 5219 at start it was 5219
    [junit] 2017-03-12 12:12:50,790 [myid:] - INFO  [main:ZKTestCase$1@68] - SUCCEEDED testWatcherAutoResetWithLocal
    [junit] 2017-03-12 12:12:50,790 [myid:] - INFO  [main:ZKTestCase$1@63] - FINISHED testWatcherAutoResetWithLocal
    [junit] Tests run: 103, Failures: 0, Errors: 0, Skipped: 0, Time elapsed: 542.911 sec,
Thread: 5, Class: org.apache.zookeeper.test.NettyNettySuiteTest
    [junit] 2017-03-12 12:12:50,880 [myid:127.0.0.1:22120] - INFO  [main-SendThread(127.0.0.1:22120):ClientCnxn$SendThread@1113]
- Opening socket connection to server 127.0.0.1/127.0.0.1:22120. Will not attempt to authenticate
using SASL (unknown error)
    [junit] 2017-03-12 12:12:50,881 [myid:] - INFO  [New I/O boss #10164:ClientCnxnSocketNetty$1@127]
- future isn't success, cause: {}
    [junit] java.net.ConnectException: Connection refused: 127.0.0.1/127.0.0.1:22120
    [junit] 	at sun.nio.ch.SocketChannelImpl.checkConnect(Native Method)
    [junit] 	at sun.nio.ch.SocketChannelImpl.finishConnect(SocketChannelImpl.java:717)
    [junit] 	at org.jboss.netty.channel.socket.nio.NioClientBoss.connect(NioClientBoss.java:152)
    [junit] 	at org.jboss.netty.channel.socket.nio.NioClientBoss.processSelectedKeys(NioClientBoss.java:105)
    [junit] 	at org.jboss.netty.channel.socket.nio.NioClientBoss.process(NioClientBoss.java:79)
    [junit] 	at org.jboss.netty.channel.socket.nio.AbstractNioSelector.run(AbstractNioSelector.java:337)
    [junit] 	at org.jboss.netty.channel.socket.nio.NioClientBoss.run(NioClientBoss.java:42)
    [junit] 	at org.jboss.netty.util.ThreadRenamingRunnable.run(ThreadRenamingRunnable.java:108)
    [junit] 	at org.jboss.netty.util.internal.DeadLockProofWorker$1.run(DeadLockProofWorker.java:42)
    [junit] 	at java.util.concurrent.ThreadPoolExecutor.runWorker(ThreadPoolExecutor.java:1142)
    [junit] 	at java.util.concurrent.ThreadPoolExecutor$Worker.run(ThreadPoolExecutor.java:617)
    [junit] 	at java.lang.Thread.run(Thread.java:745)
    [junit] 2017-03-12 12:12:50,881 [myid:] - WARN  [New I/O boss #10164:ClientCnxnSocketNetty$ZKClientHandler@439]
- Exception caught: [id: 0x70a1af46] EXCEPTION: java.net.ConnectException: Connection refused:
127.0.0.1/127.0.0.1:22120
    [junit] java.net.ConnectException: Connection refused: 127.0.0.1/127.0.0.1:22120
    [junit] 	at sun.nio.ch.SocketChannelImpl.checkConnect(Native Method)
    [junit] 	at sun.nio.ch.SocketChannelImpl.finishConnect(SocketChannelImpl.java:717)
    [junit] 	at org.jboss.netty.channel.socket.nio.NioClientBoss.connect(NioClientBoss.java:152)
    [junit] 	at org.jboss.netty.channel.socket.nio.NioClientBoss.processSelectedKeys(NioClientBoss.java:105)
    [junit] 	at org.jboss.netty.channel.socket.nio.NioClientBoss.process(NioClientBoss.java:79)
    [junit] 	at org.jboss.netty.channel.socket.nio.AbstractNioSelector.run(AbstractNioSelector.java:337)
    [junit] 	at org.jboss.netty.channel.socket.nio.NioClientBoss.run(NioClientBoss.java:42)
    [junit] 	at org.jboss.netty.util.ThreadRenamingRunnable.run(ThreadRenamingRunnable.java:108)
    [junit] 	at org.jboss.netty.util.internal.DeadLockProofWorker$1.run(DeadLockProofWorker.java:42)
    [junit] 	at java.util.concurrent.ThreadPoolExecutor.runWorker(ThreadPoolExecutor.java:1142)
    [junit] 	at java.util.concurrent.ThreadPoolExecutor$Worker.run(ThreadPoolExecutor.java:617)
    [junit] 	at java.lang.Thread.run(Thread.java:745)
    [junit] 2017-03-12 12:12:50,881 [myid:] - INFO  [New I/O boss #10164:ClientCnxnSocketNetty@208]
- channel is told closing
    [junit] 2017-03-12 12:12:50,881 [myid:127.0.0.1:22120] - INFO  [main-SendThread(127.0.0.1:22120):ClientCnxn$SendThread@1231]
- channel for sessionid 0x2011ed2e85a0000 is lost, closing socket connection and attempting
reconnect

fail.build.on.test.failure:

BUILD FAILED
/home/jenkins/jenkins-slave/workspace/ZooKeeper_branch35_jdk8/build.xml:1212: The following
error occurred while executing this line:
/home/jenkins/jenkins-slave/workspace/ZooKeeper_branch35_jdk8/build.xml:1216: Tests failed!

Total time: 13 minutes 11 seconds
Build step 'Invoke Ant' marked build as failure
Recording test results
Email was triggered for: Failure - Any
Sending email for trigger: Failure - Any



###################################################################################
############################## FAILED TESTS (if any) ##############################
1 tests failed.
FAILED:  org.apache.zookeeper.test.ReconfigTest.testPortChange

Error Message:
null

Stack Trace:
junit.framework.AssertionFailedError
	at org.apache.zookeeper.test.ReconfigTest.testPortChange(ReconfigTest.java:681)
	at org.apache.zookeeper.JUnit4ZKTestRunner$LoggedInvokeMethod.evaluate(JUnit4ZKTestRunner.java:79)



Mime
  • Unnamed multipart/mixed (inline, None, 0 bytes)
View raw message