zookeeper-dev mailing list archives

Site index · List index
Message view « Date » · « Thread »
Top « Date » · « Thread »
From Apache Jenkins Server <jenk...@builds.apache.org>
Subject ZooKeeper-trunk-openjdk7 - Build # 1407 - Failure
Date Mon, 20 Mar 2017 00:50:30 GMT
See https://builds.apache.org/job/ZooKeeper-trunk-openjdk7/1407/

###################################################################################
########################## LAST 60 LINES OF THE CONSOLE ###########################
[...truncated 61.92 MB...]
    [junit] 	at org.jboss.netty.channel.socket.nio.AbstractNioSelector.run(AbstractNioSelector.java:315)
    [junit] 	at org.jboss.netty.channel.socket.nio.AbstractNioWorker.run(AbstractNioWorker.java:89)
    [junit] 	at org.jboss.netty.channel.socket.nio.NioWorker.run(NioWorker.java:178)
    [junit] 	at org.jboss.netty.util.ThreadRenamingRunnable.run(ThreadRenamingRunnable.java:108)
    [junit] 	at org.jboss.netty.util.internal.DeadLockProofWorker$1.run(DeadLockProofWorker.java:42)
    [junit] 	at java.util.concurrent.ThreadPoolExecutor.runWorker(ThreadPoolExecutor.java:1145)
    [junit] 	at java.util.concurrent.ThreadPoolExecutor$Worker.run(ThreadPoolExecutor.java:615)
    [junit] 	at java.lang.Thread.run(Thread.java:745)
    [junit] 2017-03-20 00:50:24,744 [myid:] - INFO  [SyncThread:0:MBeanRegistry@128] - Unregister
MBean [org.apache.ZooKeeperService:name0=StandaloneServer_port24933,name1=Connections,name2=127.0.0.1,name3=0x103142533f00000]
    [junit] 2017-03-20 00:50:24,844 [myid:] - INFO  [main:ZooKeeper@1324] - Session: 0x103142533f00000
closed
    [junit] 2017-03-20 00:50:24,844 [myid:] - INFO  [main:JUnit4ZKTestRunner$LoggedInvokeMethod@82]
- Memory used 202552
    [junit] 2017-03-20 00:50:24,844 [myid:] - INFO  [main-EventThread:ClientCnxn$EventThread@513]
- EventThread shut down for session: 0x103142533f00000
    [junit] 2017-03-20 00:50:24,844 [myid:] - INFO  [main:JUnit4ZKTestRunner$LoggedInvokeMethod@87]
- Number of threads 2427
    [junit] 2017-03-20 00:50:24,845 [myid:] - INFO  [main:JUnit4ZKTestRunner$LoggedInvokeMethod@102]
- FINISHED TEST METHOD testWatcherAutoResetWithLocal
    [junit] 2017-03-20 00:50:24,845 [myid:] - INFO  [main:ClientBase@558] - tearDown starting
    [junit] 2017-03-20 00:50:24,845 [myid:] - INFO  [main:ClientBase@528] - STOPPING server
    [junit] 2017-03-20 00:50:24,845 [myid:] - INFO  [main:NettyServerCnxnFactory@464] - shutdown
called 0.0.0.0/0.0.0.0:24933
    [junit] 2017-03-20 00:50:24,853 [myid:] - INFO  [main:ZooKeeperServer@542] - shutting
down
    [junit] 2017-03-20 00:50:24,853 [myid:] - ERROR [main:ZooKeeperServer@506] - ZKShutdownHandler
is not registered, so ZooKeeper server won't take any action on ERROR or SHUTDOWN server state
changes
    [junit] 2017-03-20 00:50:24,854 [myid:] - INFO  [main:SessionTrackerImpl@232] - Shutting
down
    [junit] 2017-03-20 00:50:24,854 [myid:] - INFO  [main:PrepRequestProcessor@1008] - Shutting
down
    [junit] 2017-03-20 00:50:24,854 [myid:] - INFO  [main:SyncRequestProcessor@191] - Shutting
down
    [junit] 2017-03-20 00:50:24,854 [myid:] - INFO  [ProcessThread(sid:0 cport:24933)::PrepRequestProcessor@157]
- PrepRequestProcessor exited loop!
    [junit] 2017-03-20 00:50:24,854 [myid:] - INFO  [SyncThread:0:SyncRequestProcessor@169]
- SyncRequestProcessor exited!
    [junit] 2017-03-20 00:50:24,855 [myid:] - INFO  [main:FinalRequestProcessor@481] - shutdown
of request processor complete
    [junit] 2017-03-20 00:50:24,855 [myid:] - INFO  [main:MBeanRegistry@128] - Unregister
MBean [org.apache.ZooKeeperService:name0=StandaloneServer_port24933,name1=InMemoryDataTree]
    [junit] 2017-03-20 00:50:24,855 [myid:] - INFO  [main:MBeanRegistry@128] - Unregister
MBean [org.apache.ZooKeeperService:name0=StandaloneServer_port24933]
    [junit] 2017-03-20 00:50:24,856 [myid:] - INFO  [main:FourLetterWordMain@85] - connecting
to 127.0.0.1 24933
    [junit] 2017-03-20 00:50:24,857 [myid:] - INFO  [main:JMXEnv@146] - ensureOnly:[]
    [junit] 2017-03-20 00:50:24,868 [myid:] - INFO  [main:ClientBase@583] - fdcount after
test is: 7136 at start it was 7136
    [junit] 2017-03-20 00:50:24,868 [myid:] - INFO  [main:ZKTestCase$1@68] - SUCCEEDED testWatcherAutoResetWithLocal
    [junit] 2017-03-20 00:50:24,868 [myid:] - INFO  [main:ZKTestCase$1@63] - FINISHED testWatcherAutoResetWithLocal
    [junit] Tests run: 103, Failures: 0, Errors: 0, Skipped: 0, Time elapsed: 460.675 sec,
Thread: 6, Class: org.apache.zookeeper.test.NioNettySuiteTest
    [junit] 2017-03-20 00:50:25,015 [myid:127.0.0.1:24816] - INFO  [main-SendThread(127.0.0.1:24816):ClientCnxn$SendThread@1113]
- Opening socket connection to server 127.0.0.1/127.0.0.1:24816. Will not attempt to authenticate
using SASL (unknown error)
    [junit] 2017-03-20 00:50:25,016 [myid:127.0.0.1:24816] - WARN  [main-SendThread(127.0.0.1:24816):ClientCnxn$SendThread@1235]
- Session 0x303142202090000 for server 127.0.0.1/127.0.0.1:24816, unexpected error, closing
socket connection and attempting reconnect
    [junit] java.net.ConnectException: Connection refused
    [junit] 	at sun.nio.ch.SocketChannelImpl.checkConnect(Native Method)
    [junit] 	at sun.nio.ch.SocketChannelImpl.finishConnect(SocketChannelImpl.java:739)
    [junit] 	at org.apache.zookeeper.ClientCnxnSocketNIO.doTransport(ClientCnxnSocketNIO.java:357)
    [junit] 	at org.apache.zookeeper.ClientCnxn$SendThread.run(ClientCnxn.java:1214)
    [junit] 2017-03-20 00:50:25,157 [myid:127.0.0.1:24813] - INFO  [main-SendThread(127.0.0.1:24813):ClientCnxn$SendThread@1113]
- Opening socket connection to server 127.0.0.1/127.0.0.1:24813. Will not attempt to authenticate
using SASL (unknown error)
    [junit] 2017-03-20 00:50:25,157 [myid:127.0.0.1:24813] - WARN  [main-SendThread(127.0.0.1:24813):ClientCnxn$SendThread@1235]
- Session 0x203142205840000 for server 127.0.0.1/127.0.0.1:24813, unexpected error, closing
socket connection and attempting reconnect
    [junit] java.net.ConnectException: Connection refused
    [junit] 	at sun.nio.ch.SocketChannelImpl.checkConnect(Native Method)
    [junit] 	at sun.nio.ch.SocketChannelImpl.finishConnect(SocketChannelImpl.java:739)
    [junit] 	at org.apache.zookeeper.ClientCnxnSocketNIO.doTransport(ClientCnxnSocketNIO.java:357)
    [junit] 	at org.apache.zookeeper.ClientCnxn$SendThread.run(ClientCnxn.java:1214)

fail.build.on.test.failure:

BUILD FAILED
/home/jenkins/jenkins-slave/workspace/ZooKeeper-trunk-openjdk7/build.xml:1219: The following
error occurred while executing this line:
/home/jenkins/jenkins-slave/workspace/ZooKeeper-trunk-openjdk7/build.xml:1223: Tests failed!

Total time: 10 minutes 49 seconds
Build step 'Invoke Ant' marked build as failure
Recording test results
Email was triggered for: Failure - Any
Sending email for trigger: Failure - Any



###################################################################################
############################## FAILED TESTS (if any) ##############################
1 tests failed.
FAILED:  org.apache.zookeeper.test.NonRecoverableErrorTest.testZooKeeperServiceAvailableOnLeader

Error Message:
IOException is expected due to error injected to transaction log commit

Stack Trace:
junit.framework.AssertionFailedError: IOException is expected due to error injected to transaction
log commit
	at org.apache.zookeeper.test.NonRecoverableErrorTest.testZooKeeperServiceAvailableOnLeader(NonRecoverableErrorTest.java:115)
	at org.apache.zookeeper.JUnit4ZKTestRunner$LoggedInvokeMethod.evaluate(JUnit4ZKTestRunner.java:79)
	at java.util.concurrent.FutureTask.run(FutureTask.java:262)
	at java.lang.Thread.run(Thread.java:745)



Mime
  • Unnamed multipart/mixed (inline, None, 0 bytes)
View raw message