zookeeper-dev mailing list archives

Site index · List index
Message view « Date » · « Thread »
Top « Date » · « Thread »
From Apache Jenkins Server <jenk...@builds.apache.org>
Subject ZooKeeper_branch35_jdk8 - Build # 459 - Failure
Date Fri, 17 Mar 2017 12:13:19 GMT
See https://builds.apache.org/job/ZooKeeper_branch35_jdk8/459/

###################################################################################
########################## LAST 60 LINES OF THE CONSOLE ###########################
[...truncated 62.37 MB...]
    [junit] 2017-03-17 12:12:48,784 [myid:127.0.0.1:14161] - INFO  [main-SendThread(127.0.0.1:14161):ClientCnxn$SendThread@1113]
- Opening socket connection to server 127.0.0.1/127.0.0.1:14161. Will not attempt to authenticate
using SASL (unknown error)
    [junit] 2017-03-17 12:12:48,784 [myid:127.0.0.1:14161] - INFO  [main-SendThread(127.0.0.1:14161):ClientCnxn$SendThread@948]
- Socket connection established, initiating session, client: /127.0.0.1:47250, server: 127.0.0.1/127.0.0.1:14161
    [junit] 2017-03-17 12:12:48,785 [myid:] - INFO  [New I/O worker #1829:ZooKeeperServer@1018]
- Client attempting to renew session 0x10421fe5be80000 at /127.0.0.1:47250
    [junit] 2017-03-17 12:12:48,786 [myid:] - INFO  [New I/O worker #1829:ZooKeeperServer@727]
- Established session 0x10421fe5be80000 with negotiated timeout 6000 for client /127.0.0.1:47250
    [junit] 2017-03-17 12:12:48,786 [myid:127.0.0.1:14161] - INFO  [main-SendThread(127.0.0.1:14161):ClientCnxn$SendThread@1381]
- Session establishment complete on server 127.0.0.1/127.0.0.1:14161, sessionid = 0x10421fe5be80000,
negotiated timeout = 6000
    [junit] 2017-03-17 12:12:48,788 [myid:] - INFO  [SyncThread:0:FileTxnLog@204] - Creating
new log file: log.7
    [junit] 2017-03-17 12:12:49,245 [myid:127.0.0.1:13915] - INFO  [main-SendThread(127.0.0.1:13915):ClientCnxn$SendThread@1113]
- Opening socket connection to server 127.0.0.1/127.0.0.1:13915. Will not attempt to authenticate
using SASL (unknown error)
    [junit] 2017-03-17 12:12:49,245 [myid:127.0.0.1:13915] - WARN  [main-SendThread(127.0.0.1:13915):ClientCnxn$SendThread@1235]
- Session 0x10421f7d3730000 for server 127.0.0.1/127.0.0.1:13915, unexpected error, closing
socket connection and attempting reconnect
    [junit] java.net.ConnectException: Connection refused
    [junit] 	at sun.nio.ch.SocketChannelImpl.checkConnect(Native Method)
    [junit] 	at sun.nio.ch.SocketChannelImpl.finishConnect(SocketChannelImpl.java:717)
    [junit] 	at org.apache.zookeeper.ClientCnxnSocketNIO.doTransport(ClientCnxnSocketNIO.java:357)
    [junit] 	at org.apache.zookeeper.ClientCnxn$SendThread.run(ClientCnxn.java:1214)
    [junit] 2017-03-17 12:12:49,805 [myid:] - INFO  [ProcessThread(sid:0 cport:14161)::PrepRequestProcessor@655]
- Processed session termination for sessionid: 0x10421fe5be80000
    [junit] 2017-03-17 12:12:49,807 [myid:] - INFO  [SyncThread:0:MBeanRegistry@128] - Unregister
MBean [org.apache.ZooKeeperService:name0=StandaloneServer_port14161,name1=Connections,name2=127.0.0.1,name3=0x10421fe5be80000]
    [junit] 2017-03-17 12:12:49,807 [myid:] - INFO  [main-EventThread:ClientCnxn$EventThread@513]
- EventThread shut down for session: 0x10421fe5be80000
    [junit] 2017-03-17 12:12:49,808 [myid:] - INFO  [main:ZooKeeper@1324] - Session: 0x10421fe5be80000
closed
    [junit] 2017-03-17 12:12:49,808 [myid:] - INFO  [main:JUnit4ZKTestRunner$LoggedInvokeMethod@82]
- Memory used 111247
    [junit] 2017-03-17 12:12:49,808 [myid:] - INFO  [main:JUnit4ZKTestRunner$LoggedInvokeMethod@87]
- Number of threads 467
    [junit] 2017-03-17 12:12:49,808 [myid:] - INFO  [main:JUnit4ZKTestRunner$LoggedInvokeMethod@102]
- FINISHED TEST METHOD testWatcherAutoResetWithLocal
    [junit] 2017-03-17 12:12:49,808 [myid:] - INFO  [main:ClientBase@543] - tearDown starting
    [junit] 2017-03-17 12:12:49,808 [myid:] - INFO  [main:ClientBase@513] - STOPPING server
    [junit] 2017-03-17 12:12:49,808 [myid:] - INFO  [main:NettyServerCnxnFactory@464] - shutdown
called 0.0.0.0/0.0.0.0:14161
    [junit] 2017-03-17 12:12:49,809 [myid:] - INFO  [main:ZooKeeperServer@541] - shutting
down
    [junit] 2017-03-17 12:12:49,809 [myid:] - ERROR [main:ZooKeeperServer@505] - ZKShutdownHandler
is not registered, so ZooKeeper server won't take any action on ERROR or SHUTDOWN server state
changes
    [junit] 2017-03-17 12:12:49,809 [myid:] - INFO  [main:SessionTrackerImpl@232] - Shutting
down
    [junit] 2017-03-17 12:12:49,809 [myid:] - INFO  [main:PrepRequestProcessor@973] - Shutting
down
    [junit] 2017-03-17 12:12:49,809 [myid:] - INFO  [main:SyncRequestProcessor@191] - Shutting
down
    [junit] 2017-03-17 12:12:49,809 [myid:] - INFO  [ProcessThread(sid:0 cport:14161)::PrepRequestProcessor@154]
- PrepRequestProcessor exited loop!
    [junit] 2017-03-17 12:12:49,810 [myid:] - INFO  [SyncThread:0:SyncRequestProcessor@169]
- SyncRequestProcessor exited!
    [junit] 2017-03-17 12:12:49,810 [myid:] - INFO  [main:FinalRequestProcessor@479] - shutdown
of request processor complete
    [junit] 2017-03-17 12:12:49,810 [myid:] - INFO  [main:MBeanRegistry@128] - Unregister
MBean [org.apache.ZooKeeperService:name0=StandaloneServer_port14161,name1=InMemoryDataTree]
    [junit] 2017-03-17 12:12:49,810 [myid:] - INFO  [main:MBeanRegistry@128] - Unregister
MBean [org.apache.ZooKeeperService:name0=StandaloneServer_port14161]
    [junit] 2017-03-17 12:12:49,810 [myid:] - INFO  [main:FourLetterWordMain@85] - connecting
to 127.0.0.1 14161
    [junit] 2017-03-17 12:12:49,811 [myid:] - INFO  [main:JMXEnv@146] - ensureOnly:[]
    [junit] 2017-03-17 12:12:49,813 [myid:] - INFO  [main:ClientBase@568] - fdcount after
test is: 1395 at start it was 1391
    [junit] 2017-03-17 12:12:49,813 [myid:] - INFO  [main:ClientBase@570] - sleeping for 20
secs
    [junit] 2017-03-17 12:12:49,814 [myid:] - INFO  [main:ZKTestCase$1@68] - SUCCEEDED testWatcherAutoResetWithLocal
    [junit] 2017-03-17 12:12:49,814 [myid:] - INFO  [main:ZKTestCase$1@63] - FINISHED testWatcherAutoResetWithLocal
    [junit] Tests run: 103, Failures: 0, Errors: 0, Skipped: 0, Time elapsed: 434.73 sec,
Thread: 2, Class: org.apache.zookeeper.test.NioNettySuiteTest
    [junit] 2017-03-17 12:12:49,840 [myid:127.0.0.1:14038] - INFO  [main-SendThread(127.0.0.1:14038):ClientCnxn$SendThread@1113]
- Opening socket connection to server 127.0.0.1/127.0.0.1:14038. Will not attempt to authenticate
using SASL (unknown error)
    [junit] 2017-03-17 12:12:49,841 [myid:127.0.0.1:14038] - WARN  [main-SendThread(127.0.0.1:14038):ClientCnxn$SendThread@1235]
- Session 0x10421fb754d0000 for server 127.0.0.1/127.0.0.1:14038, unexpected error, closing
socket connection and attempting reconnect
    [junit] java.net.ConnectException: Connection refused
    [junit] 	at sun.nio.ch.SocketChannelImpl.checkConnect(Native Method)
    [junit] 	at sun.nio.ch.SocketChannelImpl.finishConnect(SocketChannelImpl.java:717)
    [junit] 	at org.apache.zookeeper.ClientCnxnSocketNIO.doTransport(ClientCnxnSocketNIO.java:357)
    [junit] 	at org.apache.zookeeper.ClientCnxn$SendThread.run(ClientCnxn.java:1214)

fail.build.on.test.failure:

BUILD FAILED
/home/jenkins/jenkins-slave/workspace/ZooKeeper_branch35_jdk8/build.xml:1219: The following
error occurred while executing this line:
/home/jenkins/jenkins-slave/workspace/ZooKeeper_branch35_jdk8/build.xml:1223: Tests failed!

Total time: 10 minutes 50 seconds
Build step 'Invoke Ant' marked build as failure
Recording test results
Email was triggered for: Failure - Any
Sending email for trigger: Failure - Any



###################################################################################
############################## FAILED TESTS (if any) ##############################
1 tests failed.
FAILED:  org.apache.zookeeper.test.ReadOnlyModeTest.testConnectionEvents

Error Message:
Index: 2, Size: 3

Stack Trace:
java.lang.IndexOutOfBoundsException: Index: 2, Size: 3
	at java.util.ArrayList.rangeCheck(ArrayList.java:653)
	at java.util.ArrayList.get(ArrayList.java:429)
	at org.apache.zookeeper.test.ReadOnlyModeTest.testConnectionEvents(ReadOnlyModeTest.java:212)
	at org.apache.zookeeper.JUnit4ZKTestRunner$LoggedInvokeMethod.evaluate(JUnit4ZKTestRunner.java:79)
	at java.util.concurrent.FutureTask.run(FutureTask.java:266)
	at java.lang.Thread.run(Thread.java:745)



Mime
  • Unnamed multipart/mixed (inline, None, 0 bytes)
View raw message