zookeeper-dev mailing list archives

Site index · List index
Message view « Date » · « Thread »
Top « Date » · « Thread »
From Apache Jenkins Server <jenk...@builds.apache.org>
Subject ZooKeeper_branch35_jdk8 - Build # 464 - Still Failing
Date Tue, 21 Mar 2017 12:10:33 GMT
See https://builds.apache.org/job/ZooKeeper_branch35_jdk8/464/

###################################################################################
########################## LAST 60 LINES OF THE CONSOLE ###########################
[...truncated 64.43 MB...]
    [junit] 2017-03-21 12:10:26,803 [myid:127.0.0.1:16854] - INFO  [main-SendThread(127.0.0.1:16854):ClientCnxn$SendThread@1113]
- Opening socket connection to server 127.0.0.1/127.0.0.1:16854. Will not attempt to authenticate
using SASL (unknown error)
    [junit] 2017-03-21 12:10:26,804 [myid:127.0.0.1:16854] - INFO  [main-SendThread(127.0.0.1:16854):ClientCnxn$SendThread@948]
- Socket connection established, initiating session, client: /127.0.0.1:43423, server: 127.0.0.1/127.0.0.1:16854
    [junit] 2017-03-21 12:10:26,804 [myid:] - INFO  [New I/O worker #6701:ZooKeeperServer@1018]
- Client attempting to renew session 0x1014d2d4b5a0000 at /127.0.0.1:43423
    [junit] 2017-03-21 12:10:26,804 [myid:] - INFO  [New I/O worker #6701:ZooKeeperServer@727]
- Established session 0x1014d2d4b5a0000 with negotiated timeout 6000 for client /127.0.0.1:43423
    [junit] 2017-03-21 12:10:26,804 [myid:127.0.0.1:16854] - INFO  [main-SendThread(127.0.0.1:16854):ClientCnxn$SendThread@1381]
- Session establishment complete on server 127.0.0.1/127.0.0.1:16854, sessionid = 0x1014d2d4b5a0000,
negotiated timeout = 6000
    [junit] 2017-03-21 12:10:26,810 [myid:] - INFO  [SyncThread:0:FileTxnLog@204] - Creating
new log file: log.7
    [junit] 2017-03-21 12:10:26,875 [myid:127.0.0.1:16737] - INFO  [main-SendThread(127.0.0.1:16737):ClientCnxn$SendThread@1113]
- Opening socket connection to server 127.0.0.1/127.0.0.1:16737. Will not attempt to authenticate
using SASL (unknown error)
    [junit] 2017-03-21 12:10:26,875 [myid:127.0.0.1:16737] - WARN  [main-SendThread(127.0.0.1:16737):ClientCnxn$SendThread@1235]
- Session 0x3014d29e07b0000 for server 127.0.0.1/127.0.0.1:16737, unexpected error, closing
socket connection and attempting reconnect
    [junit] java.net.ConnectException: Connection refused
    [junit] 	at sun.nio.ch.SocketChannelImpl.checkConnect(Native Method)
    [junit] 	at sun.nio.ch.SocketChannelImpl.finishConnect(SocketChannelImpl.java:717)
    [junit] 	at org.apache.zookeeper.ClientCnxnSocketNIO.doTransport(ClientCnxnSocketNIO.java:357)
    [junit] 	at org.apache.zookeeper.ClientCnxn$SendThread.run(ClientCnxn.java:1214)
    [junit] 2017-03-21 12:10:27,886 [myid:] - INFO  [ProcessThread(sid:0 cport:16854)::PrepRequestProcessor@613]
- Processed session termination for sessionid: 0x1014d2d4b5a0000
    [junit] 2017-03-21 12:10:27,894 [myid:] - INFO  [SyncThread:0:MBeanRegistry@128] - Unregister
MBean [org.apache.ZooKeeperService:name0=StandaloneServer_port16854,name1=Connections,name2=127.0.0.1,name3=0x1014d2d4b5a0000]
    [junit] 2017-03-21 12:10:27,894 [myid:] - INFO  [main:ZooKeeper@1326] - Session: 0x1014d2d4b5a0000
closed
    [junit] 2017-03-21 12:10:27,894 [myid:] - INFO  [main-EventThread:ClientCnxn$EventThread@513]
- EventThread shut down for session: 0x1014d2d4b5a0000
    [junit] 2017-03-21 12:10:27,894 [myid:] - INFO  [main:JUnit4ZKTestRunner$LoggedInvokeMethod@82]
- Memory used 149368
    [junit] 2017-03-21 12:10:27,895 [myid:] - INFO  [main:JUnit4ZKTestRunner$LoggedInvokeMethod@87]
- Number of threads 1643
    [junit] 2017-03-21 12:10:27,895 [myid:] - INFO  [main:JUnit4ZKTestRunner$LoggedInvokeMethod@102]
- FINISHED TEST METHOD testWatcherAutoResetWithLocal
    [junit] 2017-03-21 12:10:27,895 [myid:] - INFO  [main:ClientBase@543] - tearDown starting
    [junit] 2017-03-21 12:10:27,895 [myid:] - INFO  [main:ClientBase@513] - STOPPING server
    [junit] 2017-03-21 12:10:27,895 [myid:] - INFO  [main:NettyServerCnxnFactory@464] - shutdown
called 0.0.0.0/0.0.0.0:16854
    [junit] 2017-03-21 12:10:27,898 [myid:] - INFO  [main:ZooKeeperServer@541] - shutting
down
    [junit] 2017-03-21 12:10:27,898 [myid:] - ERROR [main:ZooKeeperServer@505] - ZKShutdownHandler
is not registered, so ZooKeeper server won't take any action on ERROR or SHUTDOWN server state
changes
    [junit] 2017-03-21 12:10:27,899 [myid:] - INFO  [main:SessionTrackerImpl@232] - Shutting
down
    [junit] 2017-03-21 12:10:27,899 [myid:] - INFO  [main:PrepRequestProcessor@1004] - Shutting
down
    [junit] 2017-03-21 12:10:27,899 [myid:] - INFO  [main:SyncRequestProcessor@191] - Shutting
down
    [junit] 2017-03-21 12:10:27,899 [myid:] - INFO  [ProcessThread(sid:0 cport:16854)::PrepRequestProcessor@156]
- PrepRequestProcessor exited loop!
    [junit] 2017-03-21 12:10:27,899 [myid:] - INFO  [SyncThread:0:SyncRequestProcessor@169]
- SyncRequestProcessor exited!
    [junit] 2017-03-21 12:10:27,899 [myid:] - INFO  [main:FinalRequestProcessor@481] - shutdown
of request processor complete
    [junit] 2017-03-21 12:10:27,899 [myid:] - INFO  [main:MBeanRegistry@128] - Unregister
MBean [org.apache.ZooKeeperService:name0=StandaloneServer_port16854,name1=InMemoryDataTree]
    [junit] 2017-03-21 12:10:27,899 [myid:] - INFO  [main:MBeanRegistry@128] - Unregister
MBean [org.apache.ZooKeeperService:name0=StandaloneServer_port16854]
    [junit] 2017-03-21 12:10:27,900 [myid:] - INFO  [main:FourLetterWordMain@85] - connecting
to 127.0.0.1 16854
    [junit] 2017-03-21 12:10:27,900 [myid:] - INFO  [main:JMXEnv@146] - ensureOnly:[]
    [junit] 2017-03-21 12:10:27,905 [myid:] - INFO  [main:ClientBase@568] - fdcount after
test is: 4840 at start it was 4836
    [junit] 2017-03-21 12:10:27,905 [myid:] - INFO  [main:ClientBase@570] - sleeping for 20
secs
    [junit] 2017-03-21 12:10:27,905 [myid:] - INFO  [main:ZKTestCase$1@68] - SUCCEEDED testWatcherAutoResetWithLocal
    [junit] 2017-03-21 12:10:27,905 [myid:] - INFO  [main:ZKTestCase$1@63] - FINISHED testWatcherAutoResetWithLocal
    [junit] Tests run: 103, Failures: 0, Errors: 0, Skipped: 0, Time elapsed: 564.341 sec,
Thread: 3, Class: org.apache.zookeeper.test.NioNettySuiteTest
    [junit] 2017-03-21 12:10:28,091 [myid:127.0.0.1:16608] - INFO  [main-SendThread(127.0.0.1:16608):ClientCnxn$SendThread@1113]
- Opening socket connection to server 127.0.0.1/127.0.0.1:16608. Will not attempt to authenticate
using SASL (unknown error)
    [junit] 2017-03-21 12:10:28,092 [myid:127.0.0.1:16608] - WARN  [main-SendThread(127.0.0.1:16608):ClientCnxn$SendThread@1235]
- Session 0x1014d24cae10000 for server 127.0.0.1/127.0.0.1:16608, unexpected error, closing
socket connection and attempting reconnect
    [junit] java.net.ConnectException: Connection refused
    [junit] 	at sun.nio.ch.SocketChannelImpl.checkConnect(Native Method)
    [junit] 	at sun.nio.ch.SocketChannelImpl.finishConnect(SocketChannelImpl.java:717)
    [junit] 	at org.apache.zookeeper.ClientCnxnSocketNIO.doTransport(ClientCnxnSocketNIO.java:357)
    [junit] 	at org.apache.zookeeper.ClientCnxn$SendThread.run(ClientCnxn.java:1214)

fail.build.on.test.failure:

BUILD FAILED
/home/jenkins/jenkins-slave/workspace/ZooKeeper_branch35_jdk8/build.xml:1219: The following
error occurred while executing this line:
/home/jenkins/jenkins-slave/workspace/ZooKeeper_branch35_jdk8/build.xml:1223: Tests failed!

Total time: 14 minutes 32 seconds
Build step 'Invoke Ant' marked build as failure
Recording test results
Email was triggered for: Failure - Any
Sending email for trigger: Failure - Any



###################################################################################
############################## FAILED TESTS (if any) ##############################
2 tests failed.
FAILED:  org.apache.zookeeper.server.quorum.ReconfigDuringLeaderSyncTest.testDuringLeaderSync

Error Message:
zoo.cfg.dynamic.next is not deleted.

Stack Trace:
junit.framework.AssertionFailedError: zoo.cfg.dynamic.next is not deleted.
	at org.apache.zookeeper.server.quorum.ReconfigDuringLeaderSyncTest.testDuringLeaderSync(ReconfigDuringLeaderSyncTest.java:165)
	at org.apache.zookeeper.JUnit4ZKTestRunner$LoggedInvokeMethod.evaluate(JUnit4ZKTestRunner.java:79)


FAILED:  org.apache.zookeeper.test.SSLTest.testSecureQuorumServer

Error Message:
waiting for server 0 being up

Stack Trace:
junit.framework.AssertionFailedError: waiting for server 0 being up
	at org.apache.zookeeper.test.SSLTest.testSecureQuorumServer(SSLTest.java:96)
	at org.apache.zookeeper.JUnit4ZKTestRunner$LoggedInvokeMethod.evaluate(JUnit4ZKTestRunner.java:79)



Mime
  • Unnamed multipart/mixed (inline, None, 0 bytes)
View raw message