zookeeper-dev mailing list archives

Site index · List index
Message view « Date » · « Thread »
Top « Date » · « Thread »
From Apache Jenkins Server <jenk...@builds.apache.org>
Subject ZooKeeper-trunk-openjdk7 - Build # 1419 - Still Failing
Date Wed, 29 Mar 2017 20:02:48 GMT
See https://builds.apache.org/job/ZooKeeper-trunk-openjdk7/1419/

###################################################################################
########################## LAST 60 LINES OF THE CONSOLE ###########################
[...truncated 64.15 MB...]
    [junit] 	at org.jboss.netty.channel.socket.nio.AbstractNioWorker.close(AbstractNioWorker.java:373)
    [junit] 	at org.jboss.netty.channel.socket.nio.NioServerSocketPipelineSink.handleAcceptedSocket(NioServerSocketPipelineSink.java:81)
    [junit] 	at org.jboss.netty.channel.socket.nio.NioServerSocketPipelineSink.eventSunk(NioServerSocketPipelineSink.java:36)
    [junit] 	at org.jboss.netty.channel.DefaultChannelPipeline$DefaultChannelHandlerContext.sendDownstream(DefaultChannelPipeline.java:779)
    [junit] 	at org.jboss.netty.channel.SimpleChannelHandler.closeRequested(SimpleChannelHandler.java:334)
    [junit] 	at org.jboss.netty.channel.SimpleChannelHandler.handleDownstream(SimpleChannelHandler.java:260)
    [junit] 	at org.jboss.netty.channel.DefaultChannelPipeline.sendDownstream(DefaultChannelPipeline.java:591)
    [junit] 	at org.jboss.netty.channel.DefaultChannelPipeline.sendDownstream(DefaultChannelPipeline.java:582)
    [junit] 	at org.jboss.netty.channel.Channels.close(Channels.java:812)
    [junit] 	at org.jboss.netty.channel.AbstractChannel.close(AbstractChannel.java:206)
    [junit] 	at org.apache.zookeeper.server.NettyServerCnxn.close(NettyServerCnxn.java:112)
    [junit] 	at org.apache.zookeeper.server.NettyServerCnxn.sendBuffer(NettyServerCnxn.java:216)
    [junit] 	at org.apache.zookeeper.server.NettyServerCnxn.sendCloseSession(NettyServerCnxn.java:455)
    [junit] 	at org.apache.zookeeper.server.FinalRequestProcessor.processRequest(FinalRequestProcessor.java:461)
    [junit] 	at org.apache.zookeeper.server.SyncRequestProcessor.flush(SyncRequestProcessor.java:182)
    [junit] 	at org.apache.zookeeper.server.SyncRequestProcessor.run(SyncRequestProcessor.java:113)
    [junit] 2017-03-29 20:02:42,734 [myid:] - INFO  [main:ZooKeeper@1324] - Session: 0x10346a0c19d0000
closed
    [junit] 2017-03-29 20:02:42,734 [myid:] - INFO  [main:JUnit4ZKTestRunner$LoggedInvokeMethod@82]
- Memory used 237228
    [junit] 2017-03-29 20:02:42,734 [myid:] - INFO  [main-EventThread:ClientCnxn$EventThread@513]
- EventThread shut down for session: 0x10346a0c19d0000
    [junit] 2017-03-29 20:02:42,734 [myid:] - INFO  [main:JUnit4ZKTestRunner$LoggedInvokeMethod@87]
- Number of threads 2427
    [junit] 2017-03-29 20:02:42,734 [myid:] - INFO  [main:JUnit4ZKTestRunner$LoggedInvokeMethod@102]
- FINISHED TEST METHOD testWatcherAutoResetWithLocal
    [junit] 2017-03-29 20:02:42,734 [myid:] - INFO  [main:ClientBase@558] - tearDown starting
    [junit] 2017-03-29 20:02:42,735 [myid:] - INFO  [main:ClientBase@528] - STOPPING server
    [junit] 2017-03-29 20:02:42,735 [myid:] - INFO  [main:NettyServerCnxnFactory@464] - shutdown
called 0.0.0.0/0.0.0.0:22240
    [junit] 2017-03-29 20:02:42,739 [myid:] - INFO  [main:ZooKeeperServer@542] - shutting
down
    [junit] 2017-03-29 20:02:42,739 [myid:] - ERROR [main:ZooKeeperServer@506] - ZKShutdownHandler
is not registered, so ZooKeeper server won't take any action on ERROR or SHUTDOWN server state
changes
    [junit] 2017-03-29 20:02:42,740 [myid:] - INFO  [main:SessionTrackerImpl@232] - Shutting
down
    [junit] 2017-03-29 20:02:42,740 [myid:] - INFO  [main:PrepRequestProcessor@1008] - Shutting
down
    [junit] 2017-03-29 20:02:42,740 [myid:] - INFO  [main:SyncRequestProcessor@191] - Shutting
down
    [junit] 2017-03-29 20:02:42,740 [myid:] - INFO  [ProcessThread(sid:0 cport:22240)::PrepRequestProcessor@157]
- PrepRequestProcessor exited loop!
    [junit] 2017-03-29 20:02:42,740 [myid:] - INFO  [SyncThread:0:SyncRequestProcessor@169]
- SyncRequestProcessor exited!
    [junit] 2017-03-29 20:02:42,740 [myid:] - INFO  [main:FinalRequestProcessor@481] - shutdown
of request processor complete
    [junit] 2017-03-29 20:02:42,740 [myid:] - INFO  [main:MBeanRegistry@128] - Unregister
MBean [org.apache.ZooKeeperService:name0=StandaloneServer_port22240,name1=InMemoryDataTree]
    [junit] 2017-03-29 20:02:42,740 [myid:] - INFO  [main:MBeanRegistry@128] - Unregister
MBean [org.apache.ZooKeeperService:name0=StandaloneServer_port22240]
    [junit] 2017-03-29 20:02:42,741 [myid:] - INFO  [main:FourLetterWordMain@85] - connecting
to 127.0.0.1 22240
    [junit] 2017-03-29 20:02:42,741 [myid:] - INFO  [main:JMXEnv@146] - ensureOnly:[]
    [junit] 2017-03-29 20:02:42,747 [myid:] - INFO  [main:ClientBase@583] - fdcount after
test is: 7139 at start it was 7139
    [junit] 2017-03-29 20:02:42,747 [myid:] - INFO  [main:ZKTestCase$1@68] - SUCCEEDED testWatcherAutoResetWithLocal
    [junit] 2017-03-29 20:02:42,747 [myid:] - INFO  [main:ZKTestCase$1@63] - FINISHED testWatcherAutoResetWithLocal
    [junit] Tests run: 103, Failures: 0, Errors: 0, Skipped: 0, Time elapsed: 482.724 sec,
Thread: 5, Class: org.apache.zookeeper.test.NioNettySuiteTest
    [junit] 2017-03-29 20:02:42,981 [myid:127.0.0.1:22117] - INFO  [main-SendThread(127.0.0.1:22117):ClientCnxn$SendThread@1113]
- Opening socket connection to server 127.0.0.1/127.0.0.1:22117. Will not attempt to authenticate
using SASL (unknown error)
    [junit] 2017-03-29 20:02:42,982 [myid:127.0.0.1:22117] - WARN  [main-SendThread(127.0.0.1:22117):ClientCnxn$SendThread@1235]
- Session 0x103469d59fd0000 for server 127.0.0.1/127.0.0.1:22117, unexpected error, closing
socket connection and attempting reconnect
    [junit] java.net.ConnectException: Connection refused
    [junit] 	at sun.nio.ch.SocketChannelImpl.checkConnect(Native Method)
    [junit] 	at sun.nio.ch.SocketChannelImpl.finishConnect(SocketChannelImpl.java:739)
    [junit] 	at org.apache.zookeeper.ClientCnxnSocketNIO.doTransport(ClientCnxnSocketNIO.java:357)
    [junit] 	at org.apache.zookeeper.ClientCnxn$SendThread.run(ClientCnxn.java:1214)

fail.build.on.test.failure:

BUILD FAILED
/home/jenkins/jenkins-slave/workspace/ZooKeeper-trunk-openjdk7/build.xml:1219: The following
error occurred while executing this line:
/home/jenkins/jenkins-slave/workspace/ZooKeeper-trunk-openjdk7/build.xml:1223: Tests failed!

Total time: 11 minutes 26 seconds
Build step 'Invoke Ant' marked build as failure
Recording test results
Email was triggered for: Failure - Any
Sending email for trigger: Failure - Any



###################################################################################
############################## FAILED TESTS (if any) ##############################
2 tests failed.
FAILED:  org.apache.zookeeper.server.quorum.Zab1_0Test.testNormalFollowerRunWithDiff

Error Message:
expected:<4294967298> but was:<4294967297>

Stack Trace:
junit.framework.AssertionFailedError: expected:<4294967298> but was:<4294967297>
	at org.apache.zookeeper.server.quorum.Zab1_0Test$5.converseWithFollower(Zab1_0Test.java:869)
	at org.apache.zookeeper.server.quorum.Zab1_0Test.testFollowerConversation(Zab1_0Test.java:517)
	at org.apache.zookeeper.server.quorum.Zab1_0Test.testNormalFollowerRunWithDiff(Zab1_0Test.java:784)
	at org.apache.zookeeper.JUnit4ZKTestRunner$LoggedInvokeMethod.evaluate(JUnit4ZKTestRunner.java:79)


FAILED:  org.apache.zookeeper.test.WatchEventWhenAutoResetTest.testNodeDataChanged

Error Message:
expected:<NodeDataChanged> but was:<NodeDeleted>

Stack Trace:
junit.framework.AssertionFailedError: expected:<NodeDataChanged> but was:<NodeDeleted>
	at org.apache.zookeeper.test.WatchEventWhenAutoResetTest$EventsWatcher.assertEvent(WatchEventWhenAutoResetTest.java:67)
	at org.apache.zookeeper.test.WatchEventWhenAutoResetTest.testNodeDataChanged(WatchEventWhenAutoResetTest.java:126)
	at org.apache.zookeeper.JUnit4ZKTestRunner$LoggedInvokeMethod.evaluate(JUnit4ZKTestRunner.java:79)



Mime
  • Unnamed multipart/mixed (inline, None, 0 bytes)
View raw message