zookeeper-dev mailing list archives

Site index · List index
Message view « Date » · « Thread »
Top « Date » · « Thread »
From "Abraham Fine (JIRA)" <j...@apache.org>
Subject [jira] [Updated] (ZOOKEEPER-2706) checkstyle broken on branch-3.4
Date Fri, 24 Feb 2017 23:08:44 GMT

     [ https://issues.apache.org/jira/browse/ZOOKEEPER-2706?page=com.atlassian.jira.plugin.system.issuetabpanels:all-tabpanel
]

Abraham Fine updated ZOOKEEPER-2706:
------------------------------------
    Description: 
While working on ZOOKEEPER-2696, [~rakeshr] and I noticed that checkstyle is failing to execute
on branch-3.4 with the following error:

{code}
BUILD FAILED
/Users/abefine/cloudera_code/zookeeper/build.xml:1595: Unable to create a Checker: cannot
initialize module PackageHtml - Unable to instantiate PackageHtml
{code}

This should essentially be a backport of ZOOKEEPER-412

  was:
While working on ZOOKEEPER-2696, [~rakeshr] and I noticed that checkstyle is failing to execute
on branch-3.4 with the following error:

{code}
BUILD FAILED
/Users/abefine/cloudera_code/zookeeper/build.xml:1595: Unable to create a Checker: cannot
initialize module PackageHtml - Unable to instantiate PackageHtml
{code}

This seems similar to ZOOKEEPER-412


> checkstyle broken on branch-3.4
> -------------------------------
>
>                 Key: ZOOKEEPER-2706
>                 URL: https://issues.apache.org/jira/browse/ZOOKEEPER-2706
>             Project: ZooKeeper
>          Issue Type: Bug
>            Reporter: Abraham Fine
>            Assignee: Abraham Fine
>
> While working on ZOOKEEPER-2696, [~rakeshr] and I noticed that checkstyle is failing
to execute on branch-3.4 with the following error:
> {code}
> BUILD FAILED
> /Users/abefine/cloudera_code/zookeeper/build.xml:1595: Unable to create a Checker: cannot
initialize module PackageHtml - Unable to instantiate PackageHtml
> {code}
> This should essentially be a backport of ZOOKEEPER-412



--
This message was sent by Atlassian JIRA
(v6.3.15#6346)

Mime
View raw message