zookeeper-dev mailing list archives

Site index · List index
Message view « Date » · « Thread »
Top « Date » · « Thread »
From Apache Jenkins Server <jenk...@builds.apache.org>
Subject ZooKeeper-trunk-solaris - Build # 1505 - Still Failing
Date Tue, 14 Feb 2017 05:49:11 GMT
See https://builds.apache.org/job/ZooKeeper-trunk-solaris/1505/

###################################################################################
########################## LAST 60 LINES OF THE CONSOLE ###########################
[...truncated 472408 lines...]
    [junit] 2017-02-14 05:50:36,898 [myid:] - INFO  [main:ClientBase@376] - STARTING server
instance 127.0.0.1:11222
    [junit] 2017-02-14 05:50:36,899 [myid:] - INFO  [main:ZooKeeperServer@908] - minSessionTimeout
set to 6000
    [junit] 2017-02-14 05:50:36,899 [myid:] - INFO  [main:ZooKeeperServer@917] - maxSessionTimeout
set to 60000
    [junit] 2017-02-14 05:50:36,899 [myid:] - INFO  [main:ZooKeeperServer@160] - Created server
with tickTime 3000 minSessionTimeout 6000 maxSessionTimeout 60000 datadir /zonestorage/hudson_solaris/home/hudson/hudson-slave/workspace/ZooKeeper-trunk-solaris/build/test/tmp/test2394915992578299615.junit.dir/version-2
snapdir /zonestorage/hudson_solaris/home/hudson/hudson-slave/workspace/ZooKeeper-trunk-solaris/build/test/tmp/test2394915992578299615.junit.dir/version-2
    [junit] 2017-02-14 05:50:36,900 [myid:] - INFO  [main:FileSnap@83] - Reading snapshot
/zonestorage/hudson_solaris/home/hudson/hudson-slave/workspace/ZooKeeper-trunk-solaris/build/test/tmp/test2394915992578299615.junit.dir/version-2/snapshot.b
    [junit] 2017-02-14 05:50:36,902 [myid:] - INFO  [main:FileTxnSnapLog@346] - Snapshotting:
0xb to /zonestorage/hudson_solaris/home/hudson/hudson-slave/workspace/ZooKeeper-trunk-solaris/build/test/tmp/test2394915992578299615.junit.dir/version-2/snapshot.b
    [junit] 2017-02-14 05:50:36,903 [myid:] - ERROR [main:ZooKeeperServer@506] - ZKShutdownHandler
is not registered, so ZooKeeper server won't take any action on ERROR or SHUTDOWN server state
changes
    [junit] 2017-02-14 05:50:36,903 [myid:] - INFO  [main:FourLetterWordMain@85] - connecting
to 127.0.0.1 11222
    [junit] 2017-02-14 05:50:36,904 [myid:] - INFO  [NIOServerCxnFactory.AcceptThread:0.0.0.0/0.0.0.0:11222:NIOServerCnxnFactory$AcceptThread@296]
- Accepted socket connection from /127.0.0.1:37319
    [junit] 2017-02-14 05:50:36,904 [myid:] - INFO  [NIOWorkerThread-1:NIOServerCnxn@485]
- Processing stat command from /127.0.0.1:37319
    [junit] 2017-02-14 05:50:36,904 [myid:] - INFO  [NIOWorkerThread-1:StatCommand@49] - Stat
command output
    [junit] 2017-02-14 05:50:36,905 [myid:] - INFO  [NIOWorkerThread-1:NIOServerCnxn@614]
- Closed socket connection for client /127.0.0.1:37319 (no session established for client)
    [junit] 2017-02-14 05:50:36,905 [myid:] - INFO  [main:JMXEnv@228] - ensureParent:[InMemoryDataTree,
StandaloneServer_port]
    [junit] 2017-02-14 05:50:36,906 [myid:] - INFO  [main:JMXEnv@245] - expect:InMemoryDataTree
    [junit] 2017-02-14 05:50:36,907 [myid:] - INFO  [main:JMXEnv@249] - found:InMemoryDataTree
org.apache.ZooKeeperService:name0=StandaloneServer_port11222,name1=InMemoryDataTree
    [junit] 2017-02-14 05:50:36,907 [myid:] - INFO  [main:JMXEnv@245] - expect:StandaloneServer_port
    [junit] 2017-02-14 05:50:36,907 [myid:] - INFO  [main:JMXEnv@249] - found:StandaloneServer_port
org.apache.ZooKeeperService:name0=StandaloneServer_port11222
    [junit] 2017-02-14 05:50:36,907 [myid:] - INFO  [main:JUnit4ZKTestRunner$LoggedInvokeMethod@82]
- Memory used 17901
    [junit] 2017-02-14 05:50:36,907 [myid:] - INFO  [main:JUnit4ZKTestRunner$LoggedInvokeMethod@87]
- Number of threads 24
    [junit] 2017-02-14 05:50:36,907 [myid:] - INFO  [main:JUnit4ZKTestRunner$LoggedInvokeMethod@102]
- FINISHED TEST METHOD testQuota
    [junit] 2017-02-14 05:50:36,908 [myid:] - INFO  [main:ClientBase@558] - tearDown starting
    [junit] 2017-02-14 05:50:36,982 [myid:] - INFO  [main:ZooKeeper@1324] - Session: 0x126b82529480000
closed
    [junit] 2017-02-14 05:50:36,982 [myid:] - INFO  [main:ClientBase@528] - STOPPING server
    [junit] 2017-02-14 05:50:36,982 [myid:] - INFO  [main-EventThread:ClientCnxn$EventThread@513]
- EventThread shut down for session: 0x126b82529480000
    [junit] 2017-02-14 05:50:36,982 [myid:] - INFO  [ConnnectionExpirer:NIOServerCnxnFactory$ConnectionExpirerThread@583]
- ConnnectionExpirerThread interrupted
    [junit] 2017-02-14 05:50:36,982 [myid:] - INFO  [NIOServerCxnFactory.SelectorThread-1:NIOServerCnxnFactory$SelectorThread@420]
- selector thread exitted run method
    [junit] 2017-02-14 05:50:36,982 [myid:] - INFO  [NIOServerCxnFactory.SelectorThread-0:NIOServerCnxnFactory$SelectorThread@420]
- selector thread exitted run method
    [junit] 2017-02-14 05:50:36,982 [myid:] - INFO  [NIOServerCxnFactory.AcceptThread:0.0.0.0/0.0.0.0:11222:NIOServerCnxnFactory$AcceptThread@219]
- accept thread exitted run method
    [junit] 2017-02-14 05:50:36,983 [myid:] - INFO  [main:ZooKeeperServer@542] - shutting
down
    [junit] 2017-02-14 05:50:36,983 [myid:] - ERROR [main:ZooKeeperServer@506] - ZKShutdownHandler
is not registered, so ZooKeeper server won't take any action on ERROR or SHUTDOWN server state
changes
    [junit] 2017-02-14 05:50:36,983 [myid:] - INFO  [main:SessionTrackerImpl@232] - Shutting
down
    [junit] 2017-02-14 05:50:36,983 [myid:] - INFO  [main:PrepRequestProcessor@1008] - Shutting
down
    [junit] 2017-02-14 05:50:36,983 [myid:] - INFO  [main:SyncRequestProcessor@191] - Shutting
down
    [junit] 2017-02-14 05:50:36,984 [myid:] - INFO  [ProcessThread(sid:0 cport:11222)::PrepRequestProcessor@157]
- PrepRequestProcessor exited loop!
    [junit] 2017-02-14 05:50:36,984 [myid:] - INFO  [SyncThread:0:SyncRequestProcessor@169]
- SyncRequestProcessor exited!
    [junit] 2017-02-14 05:50:36,984 [myid:] - INFO  [main:FinalRequestProcessor@481] - shutdown
of request processor complete
    [junit] 2017-02-14 05:50:36,984 [myid:] - INFO  [main:MBeanRegistry@128] - Unregister
MBean [org.apache.ZooKeeperService:name0=StandaloneServer_port11222,name1=InMemoryDataTree]
    [junit] 2017-02-14 05:50:36,985 [myid:] - INFO  [main:MBeanRegistry@128] - Unregister
MBean [org.apache.ZooKeeperService:name0=StandaloneServer_port11222]
    [junit] 2017-02-14 05:50:36,985 [myid:] - INFO  [main:FourLetterWordMain@85] - connecting
to 127.0.0.1 11222
    [junit] 2017-02-14 05:50:36,985 [myid:] - INFO  [main:JMXEnv@146] - ensureOnly:[]
    [junit] 2017-02-14 05:50:36,989 [myid:] - INFO  [main:ClientBase@583] - fdcount after
test is: 60 at start it was 43
    [junit] 2017-02-14 05:50:36,989 [myid:] - INFO  [main:ClientBase@585] - sleeping for 20
secs
    [junit] 2017-02-14 05:50:36,991 [myid:] - INFO  [main:ZKTestCase$1@65] - SUCCEEDED testQuota
    [junit] 2017-02-14 05:50:36,991 [myid:] - INFO  [main:ZKTestCase$1@60] - FINISHED testQuota
    [junit] Tests run: 1, Failures: 0, Errors: 0, Time elapsed: 0.902 sec

fail.build.on.test.failure:

BUILD FAILED
/zonestorage/hudson_solaris/home/hudson/hudson-slave/workspace/ZooKeeper-trunk-solaris/build.xml:1242:
The following error occurred while executing this line:
/zonestorage/hudson_solaris/home/hudson/hudson-slave/workspace/ZooKeeper-trunk-solaris/build.xml:1216:
Tests failed!

Total time: 87 minutes 1 second
Build step 'Invoke Ant' marked build as failure
[locks-and-latches] Releasing all the locks
[locks-and-latches] All the locks released
Recording test results
Email was triggered for: Failure - Any
Sending email for trigger: Failure - Any



###################################################################################
############################## FAILED TESTS (if any) ##############################
6 tests failed.
FAILED:  org.apache.zookeeper.server.quorum.RaceConditionTest.testRaceConditionBetweenLeaderAndAckRequestProcessor

Error Message:
test timed out after 30000 milliseconds

Stack Trace:
	at java.lang.Thread.sleep(Native Method)
	at org.apache.zookeeper.test.ClientBase.waitForServerState(ClientBase.java:301)
	at org.apache.zookeeper.server.quorum.RaceConditionTest.testRaceConditionBetweenLeaderAndAckRequestProcessor(RaceConditionTest.java:77)
	at org.apache.zookeeper.JUnit4ZKTestRunner$LoggedInvokeMethod.evaluate(JUnit4ZKTestRunner.java:79)
	at java.util.concurrent.FutureTask.run(FutureTask.java:262)
	at java.lang.Thread.run(Thread.java:745)


FAILED:  org.apache.zookeeper.server.quorum.Zab1_0Test.testNormalFollowerRun

Error Message:
null

Stack Trace:
java.io.EOFException
	at java.io.DataInputStream.readInt(DataInputStream.java:392)
	at org.apache.jute.BinaryInputArchive.readInt(BinaryInputArchive.java:63)
	at org.apache.zookeeper.server.quorum.QuorumPacket.deserialize(QuorumPacket.java:83)
	at org.apache.jute.BinaryInputArchive.readRecord(BinaryInputArchive.java:99)
	at org.apache.zookeeper.server.quorum.Zab1_0Test.readPacketSkippingPing(Zab1_0Test.java:346)
	at org.apache.zookeeper.server.quorum.Zab1_0Test$4.converseWithFollower(Zab1_0Test.java:688)
	at org.apache.zookeeper.server.quorum.Zab1_0Test.testFollowerConversation(Zab1_0Test.java:517)
	at org.apache.zookeeper.server.quorum.Zab1_0Test.testNormalFollowerRun(Zab1_0Test.java:649)
	at org.apache.zookeeper.JUnit4ZKTestRunner$LoggedInvokeMethod.evaluate(JUnit4ZKTestRunner.java:79)


FAILED:  org.apache.zookeeper.server.quorum.Zab1_0Test.testNormalFollowerRunWithDiff

Error Message:
expected:<4294967298> but was:<4294967297>

Stack Trace:
junit.framework.AssertionFailedError: expected:<4294967298> but was:<4294967297>
	at org.apache.zookeeper.server.quorum.Zab1_0Test$5.converseWithFollower(Zab1_0Test.java:869)
	at org.apache.zookeeper.server.quorum.Zab1_0Test.testFollowerConversation(Zab1_0Test.java:517)
	at org.apache.zookeeper.server.quorum.Zab1_0Test.testNormalFollowerRunWithDiff(Zab1_0Test.java:784)
	at org.apache.zookeeper.JUnit4ZKTestRunner$LoggedInvokeMethod.evaluate(JUnit4ZKTestRunner.java:79)


FAILED:  org.apache.zookeeper.test.WatchEventWhenAutoResetTest.testNodeDataChanged

Error Message:
expected:<NodeDataChanged> but was:<NodeDeleted>

Stack Trace:
junit.framework.AssertionFailedError: expected:<NodeDataChanged> but was:<NodeDeleted>
	at org.apache.zookeeper.test.WatchEventWhenAutoResetTest$EventsWatcher.assertEvent(WatchEventWhenAutoResetTest.java:67)
	at org.apache.zookeeper.test.WatchEventWhenAutoResetTest.testNodeDataChanged(WatchEventWhenAutoResetTest.java:117)
	at org.apache.zookeeper.JUnit4ZKTestRunner$LoggedInvokeMethod.evaluate(JUnit4ZKTestRunner.java:79)


FAILED:  org.apache.zookeeper.test.ReconfigTest.testPortChangeToBlockedPortLeader

Error Message:
client could not connect to reestablished quorum: giving up after 30+ seconds.

Stack Trace:
junit.framework.AssertionFailedError: client could not connect to reestablished quorum: giving
up after 30+ seconds.
	at org.apache.zookeeper.test.ReconfigTest.testNormalOperation(ReconfigTest.java:183)
	at org.apache.zookeeper.test.ReconfigTest.testPortChangeToBlockedPort(ReconfigTest.java:796)
	at org.apache.zookeeper.test.ReconfigTest.testPortChangeToBlockedPortLeader(ReconfigTest.java:719)
	at org.apache.zookeeper.JUnit4ZKTestRunner$LoggedInvokeMethod.evaluate(JUnit4ZKTestRunner.java:79)


FAILED:  org.apache.zookeeper.test.ReconfigTest.testPortChangeToBlockedPortFollower

Error Message:
client could not connect to reestablished quorum: giving up after 30+ seconds.

Stack Trace:
junit.framework.AssertionFailedError: client could not connect to reestablished quorum: giving
up after 30+ seconds.
	at org.apache.zookeeper.test.ReconfigTest.testNormalOperation(ReconfigTest.java:183)
	at org.apache.zookeeper.test.ReconfigTest.testPortChangeToBlockedPort(ReconfigTest.java:796)
	at org.apache.zookeeper.test.ReconfigTest.testPortChangeToBlockedPortFollower(ReconfigTest.java:715)
	at org.apache.zookeeper.JUnit4ZKTestRunner$LoggedInvokeMethod.evaluate(JUnit4ZKTestRunner.java:79)



Mime
  • Unnamed multipart/mixed (inline, None, 0 bytes)
View raw message