zookeeper-dev mailing list archives

Site index · List index
Message view « Date » · « Thread »
Top « Date » · « Thread »
From Apache Jenkins Server <jenk...@builds.apache.org>
Subject ZooKeeper-trunk-openjdk7 - Build # 1348 - Still Failing
Date Sun, 05 Feb 2017 07:34:34 GMT
See https://builds.apache.org/job/ZooKeeper-trunk-openjdk7/1348/

###################################################################################
########################## LAST 60 LINES OF THE CONSOLE ###########################
[...truncated 455893 lines...]
    [junit] 2017-02-05 07:33:51,555 [myid:] - WARN  [New I/O worker #9851:NettyServerCnxnFactory$CnxnChannelHandler@142]
- Exception caught [id: 0x20c3ac5f, /127.0.0.1:58728 :> /127.0.0.1:27626] EXCEPTION: java.nio.channels.ClosedChannelException
    [junit] java.nio.channels.ClosedChannelException
    [junit] 	at sun.nio.ch.SocketChannelImpl.ensureWriteOpen(SocketChannelImpl.java:265)
    [junit] 	at sun.nio.ch.SocketChannelImpl.write(SocketChannelImpl.java:474)
    [junit] 	at org.jboss.netty.channel.socket.nio.SocketSendBufferPool$UnpooledSendBuffer.transferTo(SocketSendBufferPool.java:203)
    [junit] 	at org.jboss.netty.channel.socket.nio.AbstractNioWorker.write0(AbstractNioWorker.java:201)
    [junit] 	at org.jboss.netty.channel.socket.nio.AbstractNioWorker.writeFromTaskLoop(AbstractNioWorker.java:151)
    [junit] 	at org.jboss.netty.channel.socket.nio.AbstractNioChannel$WriteTask.run(AbstractNioChannel.java:315)
    [junit] 	at org.jboss.netty.channel.socket.nio.AbstractNioSelector.processTaskQueue(AbstractNioSelector.java:391)
    [junit] 	at org.jboss.netty.channel.socket.nio.AbstractNioSelector.run(AbstractNioSelector.java:315)
    [junit] 	at org.jboss.netty.channel.socket.nio.AbstractNioWorker.run(AbstractNioWorker.java:89)
    [junit] 	at org.jboss.netty.channel.socket.nio.NioWorker.run(NioWorker.java:178)
    [junit] 	at org.jboss.netty.util.ThreadRenamingRunnable.run(ThreadRenamingRunnable.java:108)
    [junit] 	at org.jboss.netty.util.internal.DeadLockProofWorker$1.run(DeadLockProofWorker.java:42)
    [junit] 	at java.util.concurrent.ThreadPoolExecutor.runWorker(ThreadPoolExecutor.java:1145)
    [junit] 	at java.util.concurrent.ThreadPoolExecutor$Worker.run(ThreadPoolExecutor.java:615)
    [junit] 	at java.lang.Thread.run(Thread.java:745)
    [junit] 2017-02-05 07:33:51,555 [myid:] - INFO  [SyncThread:0:MBeanRegistry@128] - Unregister
MBean [org.apache.ZooKeeperService:name0=StandaloneServer_port27626,name1=Connections,name2=127.0.0.1,name3=0x10238251f850000]
    [junit] 2017-02-05 07:33:51,656 [myid:] - INFO  [main:ZooKeeper@1324] - Session: 0x10238251f850000
closed
    [junit] 2017-02-05 07:33:51,656 [myid:] - INFO  [main:JUnit4ZKTestRunner$LoggedInvokeMethod@82]
- Memory used 186633
    [junit] 2017-02-05 07:33:51,656 [myid:] - INFO  [main-EventThread:ClientCnxn$EventThread@513]
- EventThread shut down for session: 0x10238251f850000
    [junit] 2017-02-05 07:33:51,656 [myid:] - INFO  [main:JUnit4ZKTestRunner$LoggedInvokeMethod@87]
- Number of threads 2434
    [junit] 2017-02-05 07:33:51,656 [myid:] - INFO  [main:JUnit4ZKTestRunner$LoggedInvokeMethod@102]
- FINISHED TEST METHOD testWatcherAutoResetWithLocal
    [junit] 2017-02-05 07:33:51,657 [myid:] - INFO  [main:ClientBase@558] - tearDown starting
    [junit] 2017-02-05 07:33:51,657 [myid:] - INFO  [main:ClientBase@528] - STOPPING server
    [junit] 2017-02-05 07:33:51,657 [myid:] - INFO  [main:NettyServerCnxnFactory@464] - shutdown
called 0.0.0.0/0.0.0.0:27626
    [junit] 2017-02-05 07:33:51,664 [myid:] - INFO  [main:ZooKeeperServer@534] - shutting
down
    [junit] 2017-02-05 07:33:51,664 [myid:] - ERROR [main:ZooKeeperServer@506] - ZKShutdownHandler
is not registered, so ZooKeeper server won't take any action on ERROR or SHUTDOWN server state
changes
    [junit] 2017-02-05 07:33:51,665 [myid:] - INFO  [main:SessionTrackerImpl@232] - Shutting
down
    [junit] 2017-02-05 07:33:51,665 [myid:] - INFO  [main:PrepRequestProcessor@1008] - Shutting
down
    [junit] 2017-02-05 07:33:51,665 [myid:] - INFO  [main:SyncRequestProcessor@191] - Shutting
down
    [junit] 2017-02-05 07:33:51,665 [myid:] - INFO  [ProcessThread(sid:0 cport:27626)::PrepRequestProcessor@157]
- PrepRequestProcessor exited loop!
    [junit] 2017-02-05 07:33:51,665 [myid:] - INFO  [SyncThread:0:SyncRequestProcessor@169]
- SyncRequestProcessor exited!
    [junit] 2017-02-05 07:33:51,666 [myid:] - INFO  [main:FinalRequestProcessor@481] - shutdown
of request processor complete
    [junit] 2017-02-05 07:33:51,666 [myid:] - INFO  [main:MBeanRegistry@128] - Unregister
MBean [org.apache.ZooKeeperService:name0=StandaloneServer_port27626,name1=InMemoryDataTree]
    [junit] 2017-02-05 07:33:51,667 [myid:] - INFO  [main:MBeanRegistry@128] - Unregister
MBean [org.apache.ZooKeeperService:name0=StandaloneServer_port27626]
    [junit] 2017-02-05 07:33:51,667 [myid:] - INFO  [main:FourLetterWordMain@85] - connecting
to 127.0.0.1 27626
    [junit] 2017-02-05 07:33:51,668 [myid:] - INFO  [main:JMXEnv@146] - ensureOnly:[]
    [junit] 2017-02-05 07:33:51,682 [myid:] - INFO  [main:ClientBase@583] - fdcount after
test is: 7146 at start it was 7146
    [junit] 2017-02-05 07:33:51,683 [myid:] - INFO  [main:ZKTestCase$1@65] - SUCCEEDED testWatcherAutoResetWithLocal
    [junit] 2017-02-05 07:33:51,683 [myid:] - INFO  [main:ZKTestCase$1@60] - FINISHED testWatcherAutoResetWithLocal
    [junit] Tests run: 103, Failures: 2, Errors: 0, Skipped: 0, Time elapsed: 571.983 sec,
Thread: 7, Class: org.apache.zookeeper.test.NioNettySuiteTest
    [junit] 2017-02-05 07:33:51,695 [myid:127.0.0.1:27437] - INFO  [VCC0-SendThread(127.0.0.1:27437):ClientCnxn$SendThread@1113]
- Opening socket connection to server 127.0.0.1/127.0.0.1:27437. Will not attempt to authenticate
using SASL (unknown error)
    [junit] 2017-02-05 07:33:51,696 [myid:127.0.0.1:27437] - WARN  [VCC0-SendThread(127.0.0.1:27437):ClientCnxn$SendThread@1235]
- Session 0x0 for server 127.0.0.1/127.0.0.1:27437, unexpected error, closing socket connection
and attempting reconnect
    [junit] java.net.ConnectException: Connection refused
    [junit] 	at sun.nio.ch.SocketChannelImpl.checkConnect(Native Method)
    [junit] 	at sun.nio.ch.SocketChannelImpl.finishConnect(SocketChannelImpl.java:739)
    [junit] 	at org.apache.zookeeper.ClientCnxnSocketNIO.doTransport(ClientCnxnSocketNIO.java:357)
    [junit] 	at org.apache.zookeeper.ClientCnxn$SendThread.run(ClientCnxn.java:1214)
    [junit] Test org.apache.zookeeper.test.NioNettySuiteTest FAILED

BUILD FAILED
/home/jenkins/jenkins-slave/workspace/ZooKeeper-trunk-openjdk7/build.xml:1211: Tests failed!

Total time: 14 minutes 19 seconds
Build step 'Invoke Ant' marked build as failure
Recording test results
Email was triggered for: Failure - Any
Sending email for trigger: Failure - Any



###################################################################################
############################## FAILED TESTS (if any) ##############################
5 tests failed.
FAILED:  org.apache.zookeeper.test.LETest.testLE

Error Message:
Threads didn't join

Stack Trace:
junit.framework.AssertionFailedError: Threads didn't join
	at org.apache.zookeeper.test.LETest.testLE(LETest.java:123)
	at org.apache.zookeeper.JUnit4ZKTestRunner$LoggedInvokeMethod.evaluate(JUnit4ZKTestRunner.java:79)


FAILED:  org.apache.zookeeper.test.ReconfigTest.testPortChange

Error Message:
Existing client disconnected when client port changed!

Stack Trace:
junit.framework.AssertionFailedError: Existing client disconnected when client port changed!
	at org.apache.zookeeper.test.ReconfigTest.testPortChange(ReconfigTest.java:621)
	at org.apache.zookeeper.JUnit4ZKTestRunner$LoggedInvokeMethod.evaluate(JUnit4ZKTestRunner.java:79)


FAILED:  org.apache.zookeeper.test.ClientTest.testClientCleanup

Error Message:
null

Stack Trace:
junit.framework.AssertionFailedError
	at org.apache.zookeeper.test.ClientTest.testClientCleanup(ClientTest.java:808)
	at org.apache.zookeeper.JUnit4ZKTestRunner$LoggedInvokeMethod.evaluate(JUnit4ZKTestRunner.java:79)


FAILED:  org.apache.zookeeper.test.ReconfigTest.testQuorumSystemChange

Error Message:
waiting for server up

Stack Trace:
junit.framework.AssertionFailedError: waiting for server up
	at org.apache.zookeeper.test.QuorumUtil.startAll(QuorumUtil.java:151)
	at org.apache.zookeeper.test.ReconfigTest.testQuorumSystemChange(ReconfigTest.java:819)
	at org.apache.zookeeper.JUnit4ZKTestRunner$LoggedInvokeMethod.evaluate(JUnit4ZKTestRunner.java:79)


FAILED:  org.apache.zookeeper.test.QuorumZxidSyncTest.testBehindLeader

Error Message:
waiting for server up

Stack Trace:
junit.framework.AssertionFailedError: waiting for server up
	at org.apache.zookeeper.test.QuorumBase.startServers(QuorumBase.java:223)
	at org.apache.zookeeper.test.QuorumBase.startServers(QuorumBase.java:132)
	at org.apache.zookeeper.test.QuorumZxidSyncTest.testBehindLeader(QuorumZxidSyncTest.java:60)
	at org.apache.zookeeper.JUnit4ZKTestRunner$LoggedInvokeMethod.evaluate(JUnit4ZKTestRunner.java:79)



Mime
  • Unnamed multipart/mixed (inline, None, 0 bytes)
View raw message