zookeeper-dev mailing list archives

Site index · List index
Message view « Date » · « Thread »
Top « Date » · « Thread »
From Apache Jenkins Server <jenk...@builds.apache.org>
Subject ZooKeeper-trunk - Build # 3262 - Still Failing
Date Sun, 05 Feb 2017 00:36:44 GMT
See https://builds.apache.org/job/ZooKeeper-trunk/3262/

###################################################################################
########################## LAST 60 LINES OF THE CONSOLE ###########################
[...truncated 473702 lines...]
    [junit] 	at java.lang.Thread.run(Thread.java:745)
    [junit] 2017-02-05 00:34:03,842 [myid:] - INFO  [New I/O boss #10164:ClientCnxnSocketNetty@208]
- channel is told closing
    [junit] 2017-02-05 00:34:03,842 [myid:127.0.0.1:22120] - INFO  [main-SendThread(127.0.0.1:22120):ClientCnxn$SendThread@1231]
- channel for sessionid 0x200ce51bb1c0000 is lost, closing socket connection and attempting
reconnect
    [junit] 2017-02-05 00:34:03,938 [myid:127.0.0.1:22117] - INFO  [main-SendThread(127.0.0.1:22117):ClientCnxn$SendThread@1113]
- Opening socket connection to server 127.0.0.1/127.0.0.1:22117. Will not attempt to authenticate
using SASL (unknown error)
    [junit] 2017-02-05 00:34:03,938 [myid:] - INFO  [New I/O boss #10131:ClientCnxnSocketNetty$1@127]
- future isn't success, cause: {}
    [junit] java.net.ConnectException: Connection refused: 127.0.0.1/127.0.0.1:22117
    [junit] 	at sun.nio.ch.SocketChannelImpl.checkConnect(Native Method)
    [junit] 	at sun.nio.ch.SocketChannelImpl.finishConnect(SocketChannelImpl.java:744)
    [junit] 	at org.jboss.netty.channel.socket.nio.NioClientBoss.connect(NioClientBoss.java:152)
    [junit] 	at org.jboss.netty.channel.socket.nio.NioClientBoss.processSelectedKeys(NioClientBoss.java:105)
    [junit] 	at org.jboss.netty.channel.socket.nio.NioClientBoss.process(NioClientBoss.java:79)
    [junit] 	at org.jboss.netty.channel.socket.nio.AbstractNioSelector.run(AbstractNioSelector.java:337)
    [junit] 	at org.jboss.netty.channel.socket.nio.NioClientBoss.run(NioClientBoss.java:42)
    [junit] 	at org.jboss.netty.util.ThreadRenamingRunnable.run(ThreadRenamingRunnable.java:108)
    [junit] 	at org.jboss.netty.util.internal.DeadLockProofWorker$1.run(DeadLockProofWorker.java:42)
    [junit] 	at java.util.concurrent.ThreadPoolExecutor.runWorker(ThreadPoolExecutor.java:1145)
    [junit] 	at java.util.concurrent.ThreadPoolExecutor$Worker.run(ThreadPoolExecutor.java:615)
    [junit] 	at java.lang.Thread.run(Thread.java:745)
    [junit] 2017-02-05 00:34:03,938 [myid:] - WARN  [New I/O boss #10131:ClientCnxnSocketNetty$ZKClientHandler@439]
- Exception caught: [id: 0x926ee084] EXCEPTION: java.net.ConnectException: Connection refused:
127.0.0.1/127.0.0.1:22117
    [junit] java.net.ConnectException: Connection refused: 127.0.0.1/127.0.0.1:22117
    [junit] 	at sun.nio.ch.SocketChannelImpl.checkConnect(Native Method)
    [junit] 	at sun.nio.ch.SocketChannelImpl.finishConnect(SocketChannelImpl.java:744)
    [junit] 	at org.jboss.netty.channel.socket.nio.NioClientBoss.connect(NioClientBoss.java:152)
    [junit] 	at org.jboss.netty.channel.socket.nio.NioClientBoss.processSelectedKeys(NioClientBoss.java:105)
    [junit] 	at org.jboss.netty.channel.socket.nio.NioClientBoss.process(NioClientBoss.java:79)
    [junit] 	at org.jboss.netty.channel.socket.nio.AbstractNioSelector.run(AbstractNioSelector.java:337)
    [junit] 	at org.jboss.netty.channel.socket.nio.NioClientBoss.run(NioClientBoss.java:42)
    [junit] 	at org.jboss.netty.util.ThreadRenamingRunnable.run(ThreadRenamingRunnable.java:108)
    [junit] 	at org.jboss.netty.util.internal.DeadLockProofWorker$1.run(DeadLockProofWorker.java:42)
    [junit] 	at java.util.concurrent.ThreadPoolExecutor.runWorker(ThreadPoolExecutor.java:1145)
    [junit] 	at java.util.concurrent.ThreadPoolExecutor$Worker.run(ThreadPoolExecutor.java:615)
    [junit] 	at java.lang.Thread.run(Thread.java:745)
    [junit] 2017-02-05 00:34:03,939 [myid:] - INFO  [New I/O boss #10131:ClientCnxnSocketNetty@208]
- channel is told closing
    [junit] 2017-02-05 00:34:03,939 [myid:127.0.0.1:22117] - INFO  [main-SendThread(127.0.0.1:22117):ClientCnxn$SendThread@1231]
- channel for sessionid 0x100ce51bb1c0000 is lost, closing socket connection and attempting
reconnect
    [junit] Running org.apache.zookeeper.test.NettyNettySuiteTest in thread 5
    [junit] Tests run: 1, Failures: 0, Errors: 1, Skipped: 0, Time elapsed: 0 sec, Thread:
5, Class: org.apache.zookeeper.test.NettyNettySuiteTest
    [junit] Test org.apache.zookeeper.test.NettyNettySuiteTest FAILED (timeout)

BUILD FAILED
/home/jenkins/jenkins-slave/workspace/ZooKeeper-trunk/build.xml:1326: The following error
occurred while executing this line:
/home/jenkins/jenkins-slave/workspace/ZooKeeper-trunk/build.xml:1211: Tests failed!

Total time: 20 minutes 30 seconds
Build step 'Execute shell' marked build as failure
[FINDBUGS] Skipping publisher since build result is FAILURE
[WARNINGS] Skipping publisher since build result is FAILURE
Archiving artifacts
Setting JDK_1_7_LATEST__HOME=/home/jenkins/tools/java/latest1.7
Recording fingerprints
Setting JDK_1_7_LATEST__HOME=/home/jenkins/tools/java/latest1.7
Recording test results
Setting JDK_1_7_LATEST__HOME=/home/jenkins/tools/java/latest1.7
Publishing Javadoc
Setting JDK_1_7_LATEST__HOME=/home/jenkins/tools/java/latest1.7
Setting JDK_1_7_LATEST__HOME=/home/jenkins/tools/java/latest1.7
Email was triggered for: Failure - Any
Sending email for trigger: Failure - Any
Setting JDK_1_7_LATEST__HOME=/home/jenkins/tools/java/latest1.7
Setting JDK_1_7_LATEST__HOME=/home/jenkins/tools/java/latest1.7



###################################################################################
############################## FAILED TESTS (if any) ##############################
2 tests failed.
FAILED:  org.apache.zookeeper.server.ZxidRolloverTest.testSimpleRolloverFollower

Error Message:
Timeout occurred. Please note the time in the report does not reflect the time until the timeout.

Stack Trace:
junit.framework.AssertionFailedError: Timeout occurred. Please note the time in the report
does not reflect the time until the timeout.
	at java.lang.Thread.run(Thread.java:745)


FAILED:  org.apache.zookeeper.test.NettyNettySuiteTest.testRemoveAddTwo

Error Message:
Timeout occurred. Please note the time in the report does not reflect the time until the timeout.

Stack Trace:
junit.framework.AssertionFailedError: Timeout occurred. Please note the time in the report
does not reflect the time until the timeout.
	at java.lang.Thread.run(Thread.java:745)



Mime
  • Unnamed multipart/mixed (inline, None, 0 bytes)
View raw message