zookeeper-dev mailing list archives

Site index · List index
Message view « Date » · « Thread »
Top « Date » · « Thread »
From Apache Jenkins Server <jenk...@builds.apache.org>
Subject ZooKeeper-trunk-jdk8 - Build # 944 - Failure
Date Wed, 15 Feb 2017 17:29:22 GMT
See https://builds.apache.org/job/ZooKeeper-trunk-jdk8/944/

###################################################################################
########################## LAST 60 LINES OF THE CONSOLE ###########################
[...truncated 501220 lines...]
    [junit] 2017-02-15 17:29:17,146 [myid:] - INFO  [ProcessThread(sid:0 cport:14161)::PrepRequestProcessor@617]
- Processed session termination for sessionid: 0x1025a5cff6e0000
    [junit] 2017-02-15 17:29:17,153 [myid:] - WARN  [New I/O worker #16271:NettyServerCnxnFactory$CnxnChannelHandler@142]
- Exception caught [id: 0xeefdbdce, /127.0.0.1:47212 :> /127.0.0.1:14161] EXCEPTION: java.nio.channels.ClosedChannelException
    [junit] java.nio.channels.ClosedChannelException
    [junit] 	at sun.nio.ch.SocketChannelImpl.ensureWriteOpen(SocketChannelImpl.java:270)
    [junit] 	at sun.nio.ch.SocketChannelImpl.write(SocketChannelImpl.java:461)
    [junit] 	at org.jboss.netty.channel.socket.nio.SocketSendBufferPool$UnpooledSendBuffer.transferTo(SocketSendBufferPool.java:203)
    [junit] 	at org.jboss.netty.channel.socket.nio.AbstractNioWorker.write0(AbstractNioWorker.java:201)
    [junit] 	at org.jboss.netty.channel.socket.nio.AbstractNioWorker.writeFromTaskLoop(AbstractNioWorker.java:151)
    [junit] 	at org.jboss.netty.channel.socket.nio.AbstractNioChannel$WriteTask.run(AbstractNioChannel.java:315)
    [junit] 	at org.jboss.netty.channel.socket.nio.AbstractNioSelector.processTaskQueue(AbstractNioSelector.java:391)
    [junit] 	at org.jboss.netty.channel.socket.nio.AbstractNioSelector.run(AbstractNioSelector.java:315)
    [junit] 	at org.jboss.netty.channel.socket.nio.AbstractNioWorker.run(AbstractNioWorker.java:89)
    [junit] 	at org.jboss.netty.channel.socket.nio.NioWorker.run(NioWorker.java:178)
    [junit] 	at org.jboss.netty.util.ThreadRenamingRunnable.run(ThreadRenamingRunnable.java:108)
    [junit] 	at org.jboss.netty.util.internal.DeadLockProofWorker$1.run(DeadLockProofWorker.java:42)
    [junit] 	at java.util.concurrent.ThreadPoolExecutor.runWorker(ThreadPoolExecutor.java:1142)
    [junit] 	at java.util.concurrent.ThreadPoolExecutor$Worker.run(ThreadPoolExecutor.java:617)
    [junit] 	at java.lang.Thread.run(Thread.java:745)
    [junit] 2017-02-15 17:29:17,154 [myid:] - INFO  [New I/O worker #16174:ClientCnxnSocketNetty$ZKClientHandler@384]
- channel is disconnected: [id: 0x539d381c, /127.0.0.1:47212 :> 127.0.0.1/127.0.0.1:14161]
    [junit] 2017-02-15 17:29:17,154 [myid:] - INFO  [New I/O worker #16174:ClientCnxnSocketNetty@208]
- channel is told closing
    [junit] 2017-02-15 17:29:17,153 [myid:] - INFO  [SyncThread:0:MBeanRegistry@128] - Unregister
MBean [org.apache.ZooKeeperService:name0=StandaloneServer_port14161,name1=Connections,name2=127.0.0.1,name3=0x1025a5cff6e0000]
    [junit] 2017-02-15 17:29:17,154 [myid:] - INFO  [main:ClientCnxnSocketNetty@208] - channel
is told closing
    [junit] 2017-02-15 17:29:17,154 [myid:] - INFO  [main:ZooKeeper@1324] - Session: 0x1025a5cff6e0000
closed
    [junit] 2017-02-15 17:29:17,155 [myid:] - INFO  [main:JUnit4ZKTestRunner$LoggedInvokeMethod@82]
- Memory used 224610
    [junit] 2017-02-15 17:29:17,154 [myid:] - INFO  [main-EventThread:ClientCnxn$EventThread@513]
- EventThread shut down for session: 0x1025a5cff6e0000
    [junit] 2017-02-15 17:29:17,155 [myid:] - INFO  [main:JUnit4ZKTestRunner$LoggedInvokeMethod@87]
- Number of threads 1813
    [junit] 2017-02-15 17:29:17,155 [myid:] - INFO  [main:JUnit4ZKTestRunner$LoggedInvokeMethod@102]
- FINISHED TEST METHOD testWatcherAutoResetWithLocal
    [junit] 2017-02-15 17:29:17,155 [myid:] - INFO  [main:ClientBase@558] - tearDown starting
    [junit] 2017-02-15 17:29:17,155 [myid:] - INFO  [main:ClientBase@528] - STOPPING server
    [junit] 2017-02-15 17:29:17,155 [myid:] - INFO  [main:NettyServerCnxnFactory@464] - shutdown
called 0.0.0.0/0.0.0.0:14161
    [junit] 2017-02-15 17:29:17,159 [myid:] - INFO  [main:ZooKeeperServer@542] - shutting
down
    [junit] 2017-02-15 17:29:17,159 [myid:] - ERROR [main:ZooKeeperServer@506] - ZKShutdownHandler
is not registered, so ZooKeeper server won't take any action on ERROR or SHUTDOWN server state
changes
    [junit] 2017-02-15 17:29:17,159 [myid:] - INFO  [main:SessionTrackerImpl@232] - Shutting
down
    [junit] 2017-02-15 17:29:17,159 [myid:] - INFO  [main:PrepRequestProcessor@1008] - Shutting
down
    [junit] 2017-02-15 17:29:17,159 [myid:] - INFO  [main:SyncRequestProcessor@191] - Shutting
down
    [junit] 2017-02-15 17:29:17,159 [myid:] - INFO  [ProcessThread(sid:0 cport:14161)::PrepRequestProcessor@157]
- PrepRequestProcessor exited loop!
    [junit] 2017-02-15 17:29:17,160 [myid:] - INFO  [SyncThread:0:SyncRequestProcessor@169]
- SyncRequestProcessor exited!
    [junit] 2017-02-15 17:29:17,160 [myid:] - INFO  [main:FinalRequestProcessor@481] - shutdown
of request processor complete
    [junit] 2017-02-15 17:29:17,212 [myid:] - INFO  [main:MBeanRegistry@128] - Unregister
MBean [org.apache.ZooKeeperService:name0=StandaloneServer_port14161,name1=InMemoryDataTree]
    [junit] 2017-02-15 17:29:17,212 [myid:] - INFO  [main:MBeanRegistry@128] - Unregister
MBean [org.apache.ZooKeeperService:name0=StandaloneServer_port14161]
    [junit] 2017-02-15 17:29:17,213 [myid:] - INFO  [main:FourLetterWordMain@85] - connecting
to 127.0.0.1 14161
    [junit] 2017-02-15 17:29:17,213 [myid:] - INFO  [main:JMXEnv@146] - ensureOnly:[]
    [junit] 2017-02-15 17:29:17,218 [myid:] - INFO  [main:ClientBase@583] - fdcount after
test is: 5217 at start it was 5217
    [junit] 2017-02-15 17:29:17,218 [myid:] - INFO  [main:ZKTestCase$1@65] - SUCCEEDED testWatcherAutoResetWithLocal
    [junit] 2017-02-15 17:29:17,218 [myid:] - INFO  [main:ZKTestCase$1@60] - FINISHED testWatcherAutoResetWithLocal
    [junit] Tests run: 103, Failures: 0, Errors: 0, Skipped: 0, Time elapsed: 570.501 sec,
Thread: 2, Class: org.apache.zookeeper.test.NettyNettySuiteTest

fail.build.on.test.failure:

BUILD FAILED
/home/jenkins/jenkins-slave/workspace/ZooKeeper-trunk-jdk8/build.xml:1212: The following error
occurred while executing this line:
/home/jenkins/jenkins-slave/workspace/ZooKeeper-trunk-jdk8/build.xml:1216: Tests failed!

Total time: 13 minutes 57 seconds
Build step 'Invoke Ant' marked build as failure
[WARNINGS] Skipping publisher since build result is FAILURE
Recording test results
Email was triggered for: Failure - Any
Sending email for trigger: Failure - Any



###################################################################################
############################## FAILED TESTS (if any) ##############################
1 tests failed.
FAILED:  org.apache.zookeeper.server.quorum.ReconfigRecoveryTest.testCurrentServersAreObserversInNextConfig

Error Message:
waiting for server 4 being up

Stack Trace:
junit.framework.AssertionFailedError: waiting for server 4 being up
	at org.apache.zookeeper.server.quorum.ReconfigRecoveryTest.testCurrentServersAreObserversInNextConfig(ReconfigRecoveryTest.java:217)
	at org.apache.zookeeper.JUnit4ZKTestRunner$LoggedInvokeMethod.evaluate(JUnit4ZKTestRunner.java:79)



Mime
  • Unnamed multipart/mixed (inline, None, 0 bytes)
View raw message