zookeeper-dev mailing list archives

Site index · List index
Message view « Date » · « Thread »
Top « Date » · « Thread »
From Apache Jenkins Server <jenk...@builds.apache.org>
Subject ZooKeeper_branch35_solaris - Build # 432 - Still Failing
Date Sat, 11 Feb 2017 16:41:28 GMT
See https://builds.apache.org/job/ZooKeeper_branch35_solaris/432/

###################################################################################
########################## LAST 60 LINES OF THE CONSOLE ###########################
[...truncated 119411 lines...]
    [junit] 2017-02-11 16:42:02,303 [myid:] - INFO  [main:WatchLeakTest$FakeSK@237] - Channel
is ready for reading and writing
    [junit] 2017-02-11 16:42:03,421 [myid:] - INFO  [main:WatchLeakTest@158] - Watches processed
    [junit] 2017-02-11 16:42:03,421 [myid:] - INFO  [main:WatchLeakTest@167] - session is
valid, watches = 1
    [junit] 2017-02-11 16:42:03,422 [myid:] - INFO  [main:LearnerZooKeeperServer@165] - Shutting
down
    [junit] 2017-02-11 16:42:03,422 [myid:] - INFO  [main:ZooKeeperServer@533] - shutting
down
    [junit] 2017-02-11 16:42:03,422 [myid:] - INFO  [main:FollowerRequestProcessor@138] -
Shutting down
    [junit] 2017-02-11 16:42:03,422 [myid:] - INFO  [main:CommitProcessor@358] - Shutting
down
    [junit] 2017-02-11 16:42:03,422 [myid:] - INFO  [FollowerRequestProcessor:0:FollowerRequestProcessor@109]
- FollowerRequestProcessor exited loop!
    [junit] 2017-02-11 16:42:03,422 [myid:] - INFO  [CommitProcessor:0:CommitProcessor@193]
- CommitProcessor exited loop!
    [junit] 2017-02-11 16:42:03,472 [myid:] - INFO  [main:FinalRequestProcessor@479] - shutdown
of request processor complete
    [junit] 2017-02-11 16:42:03,472 [myid:] - INFO  [main:MBeanRegistry@128] - Unregister
MBean [org.apache.ZooKeeperService:name0=InMemoryDataTree]
    [junit] 2017-02-11 16:42:03,473 [myid:] - INFO  [main:SyncRequestProcessor@191] - Shutting
down
    [junit] 2017-02-11 16:42:03,473 [myid:] - INFO  [SyncThread:0:SyncRequestProcessor@169]
- SyncRequestProcessor exited!
    [junit] 2017-02-11 16:42:03,473 [myid:] - INFO  [main:JUnit4ZKTestRunner$LoggedInvokeMethod@82]
- Memory used 13666
    [junit] 2017-02-11 16:42:03,473 [myid:] - INFO  [main:JUnit4ZKTestRunner$LoggedInvokeMethod@87]
- Number of threads 4
    [junit] 2017-02-11 16:42:03,473 [myid:] - INFO  [main:JUnit4ZKTestRunner$LoggedInvokeMethod@102]
- FINISHED TEST METHOD testWatchesLeak
    [junit] 2017-02-11 16:42:04,517 [myid:] - INFO  [main:JUnit4ZKTestRunner$LoggedInvokeMethod@77]
- RUNNING TEST METHOD testWatchesLeak
    [junit] 2017-02-11 16:42:04,522 [myid:] - INFO  [main:ZooKeeperServer@893] - minSessionTimeout
set to 0
    [junit] 2017-02-11 16:42:04,522 [myid:] - INFO  [main:ZooKeeperServer@902] - maxSessionTimeout
set to 0
    [junit] 2017-02-11 16:42:04,524 [myid:] - INFO  [main:ZooKeeperServer@159] - Created server
with tickTime 0 minSessionTimeout 0 maxSessionTimeout 0 datadir  snapdir 
    [junit] 2017-02-11 16:42:04,525 [myid:] - INFO  [main:CommitProcessor@254] - Configuring
CommitProcessor with 8 worker threads.
    [junit] 2017-02-11 16:42:04,526 [myid:] - INFO  [main:WatchLeakTest@139] - Follower created
    [junit] 2017-02-11 16:42:04,529 [myid:] - INFO  [main:WatchLeakTest$FakeSK@237] - Channel
is ready for reading and writing
    [junit] 2017-02-11 16:42:04,531 [myid:] - INFO  [main:ZooKeeperServer@1004] - Client attempting
to renew session 0xbabe at null
    [junit] 2017-02-11 16:42:04,532 [myid:] - INFO  [main:Learner@110] - Revalidating client:
0xbabe
    [junit] 2017-02-11 16:42:04,533 [myid:] - INFO  [main:WatchLeakTest@148] - Client connection
sent
    [junit] 2017-02-11 16:42:04,534 [myid:] - INFO  [main:ZooKeeperServer@721] - Invalid session
0xbabe for client null, probably expired
    [junit] 2017-02-11 16:42:04,535 [myid:] - INFO  [main:WatchLeakTest@152] - Session validation
sent
    [junit] 2017-02-11 16:42:04,535 [myid:] - INFO  [main:WatchLeakTest$FakeSK@241] - Channel
is ready for writing only
    [junit] 2017-02-11 16:42:04,536 [myid:] - INFO  [main:WatchLeakTest$FakeSK@241] - Channel
is ready for writing only
    [junit] 2017-02-11 16:42:05,541 [myid:] - INFO  [main:WatchLeakTest@158] - Watches processed
    [junit] 2017-02-11 16:42:05,541 [myid:] - INFO  [main:WatchLeakTest@163] - session is
not valid, watches = 0
    [junit] 2017-02-11 16:42:05,541 [myid:] - INFO  [main:LearnerZooKeeperServer@165] - Shutting
down
    [junit] 2017-02-11 16:42:05,541 [myid:] - INFO  [main:ZooKeeperServer@533] - shutting
down
    [junit] 2017-02-11 16:42:05,541 [myid:] - INFO  [main:FollowerRequestProcessor@138] -
Shutting down
    [junit] 2017-02-11 16:42:05,542 [myid:] - INFO  [main:CommitProcessor@358] - Shutting
down
    [junit] 2017-02-11 16:42:05,542 [myid:] - INFO  [FollowerRequestProcessor:0:FollowerRequestProcessor@109]
- FollowerRequestProcessor exited loop!
    [junit] 2017-02-11 16:42:05,542 [myid:] - INFO  [main:FinalRequestProcessor@479] - shutdown
of request processor complete
    [junit] 2017-02-11 16:42:05,542 [myid:] - INFO  [CommitProcessor:0:CommitProcessor@193]
- CommitProcessor exited loop!
    [junit] 2017-02-11 16:42:05,543 [myid:] - INFO  [main:MBeanRegistry@128] - Unregister
MBean [org.apache.ZooKeeperService:name0=InMemoryDataTree]
    [junit] 2017-02-11 16:42:05,543 [myid:] - INFO  [main:SyncRequestProcessor@191] - Shutting
down
    [junit] 2017-02-11 16:42:05,543 [myid:] - INFO  [SyncThread:0:SyncRequestProcessor@169]
- SyncRequestProcessor exited!
    [junit] 2017-02-11 16:42:05,543 [myid:] - INFO  [main:JUnit4ZKTestRunner$LoggedInvokeMethod@82]
- Memory used 14508
    [junit] 2017-02-11 16:42:05,543 [myid:] - INFO  [main:JUnit4ZKTestRunner$LoggedInvokeMethod@87]
- Number of threads 4
    [junit] 2017-02-11 16:42:05,543 [myid:] - INFO  [main:JUnit4ZKTestRunner$LoggedInvokeMethod@102]
- FINISHED TEST METHOD testWatchesLeak
    [junit] Tests run: 2, Failures: 0, Errors: 0, Time elapsed: 30.215 sec
    [junit] Running org.apache.zookeeper.server.quorum.Zab1_0Test
    [junit] Tests run: 1, Failures: 0, Errors: 1, Time elapsed: 0 sec

BUILD FAILED
/zonestorage/hudson_solaris/home/hudson/hudson-slave/workspace/ZooKeeper_branch35_solaris/build.xml:1227:
Process fork failed.

Total time: 32 minutes 36 seconds
Build step 'Invoke Ant' marked build as failure
[locks-and-latches] Releasing all the locks
[locks-and-latches] All the locks released
Recording test results
Email was triggered for: Failure - Any
Sending email for trigger: Failure - Any



###################################################################################
############################## FAILED TESTS (if any) ##############################
5 tests failed.
FAILED:  org.apache.zookeeper.server.quorum.RaceConditionTest.testRaceConditionBetweenLeaderAndAckRequestProcessor

Error Message:
test timed out after 30000 milliseconds

Stack Trace:
	at java.lang.Thread.sleep(Native Method)
	at org.apache.zookeeper.test.ClientBase.waitForServerUp(ClientBase.java:257)
	at org.apache.zookeeper.test.ClientBase.waitForServerUp(ClientBase.java:232)
	at org.apache.zookeeper.server.quorum.RaceConditionTest.startQuorum(RaceConditionTest.java:121)
	at org.apache.zookeeper.server.quorum.RaceConditionTest.testRaceConditionBetweenLeaderAndAckRequestProcessor(RaceConditionTest.java:67)
	at org.apache.zookeeper.JUnit4ZKTestRunner$LoggedInvokeMethod.evaluate(JUnit4ZKTestRunner.java:79)
	at java.util.concurrent.FutureTask.run(FutureTask.java:262)
	at java.lang.Thread.run(Thread.java:745)


FAILED:  org.apache.zookeeper.server.quorum.ReconfigBackupTest.testReconfigCreateNewVersionFile

Error Message:
waiting for server 0 being up

Stack Trace:
junit.framework.AssertionFailedError: waiting for server 0 being up
	at org.apache.zookeeper.server.quorum.ReconfigBackupTest.testReconfigCreateNewVersionFile(ReconfigBackupTest.java:169)
	at org.apache.zookeeper.JUnit4ZKTestRunner$LoggedInvokeMethod.evaluate(JUnit4ZKTestRunner.java:79)


FAILED:  org.apache.zookeeper.server.quorum.ReconfigDuringLeaderSyncTest.testDuringLeaderSync

Error Message:
null

Stack Trace:
java.lang.NullPointerException
	at org.apache.zookeeper.server.quorum.ReconfigDuringLeaderSyncTest.tearDown(ReconfigDuringLeaderSyncTest.java:199)


FAILED:  org.apache.zookeeper.server.quorum.ReconfigRecoveryTest.testNextConfigAlreadyActive

Error Message:
waiting for server 2 being up

Stack Trace:
junit.framework.AssertionFailedError: waiting for server 2 being up
	at org.apache.zookeeper.server.quorum.ReconfigRecoveryTest.testNextConfigAlreadyActive(ReconfigRecoveryTest.java:333)
	at org.apache.zookeeper.JUnit4ZKTestRunner$LoggedInvokeMethod.evaluate(JUnit4ZKTestRunner.java:79)


FAILED:  org.apache.zookeeper.server.quorum.Zab1_0Test.unknown

Error Message:
Forked Java VM exited abnormally. Please note the time in the report does not reflect the
time until the VM exit.

Stack Trace:
junit.framework.AssertionFailedError: Forked Java VM exited abnormally. Please note the time
in the report does not reflect the time until the VM exit.



Mime
  • Unnamed multipart/mixed (inline, None, 0 bytes)
View raw message