zookeeper-dev mailing list archives

Site index · List index
Message view « Date » · « Thread »
Top « Date » · « Thread »
From Apache Jenkins Server <jenk...@builds.apache.org>
Subject ZooKeeper_branch35_openjdk7 - Build # 426 - Still Failing
Date Tue, 21 Feb 2017 09:57:13 GMT
See https://builds.apache.org/job/ZooKeeper_branch35_openjdk7/426/

###################################################################################
########################## LAST 60 LINES OF THE CONSOLE ###########################
[...truncated 233.88 KB...]
    [junit] 2017-02-21 09:57:10,495 [myid:] - INFO  [main:ZKTestCase$1@65] - SUCCEEDED testCreateSequentialCommandWithoutPath
    [junit] 2017-02-21 09:57:10,495 [myid:] - INFO  [main:ZKTestCase$1@60] - FINISHED testCreateSequentialCommandWithoutPath
    [junit] 2017-02-21 09:57:10,496 [myid:] - INFO  [main:PortAssignment@85] - Assigned port
21998 from range 21993 - 24685.
    [junit] 2017-02-21 09:57:10,496 [myid:] - INFO  [main:ZKTestCase$1@55] - STARTING testCreateNodeWithoutData
    [junit] 2017-02-21 09:57:10,496 [myid:] - INFO  [main:ClientBase@448] - Initial fdcount
is: 50
    [junit] 2017-02-21 09:57:10,506 [myid:] - INFO  [main:ClientBase@466] - STARTING server
    [junit] 2017-02-21 09:57:10,506 [myid:] - INFO  [main:ClientBase@386] - CREATING server
instance 127.0.0.1:21998
    [junit] 2017-02-21 09:57:10,506 [myid:] - INFO  [main:NIOServerCnxnFactory@673] - Configuring
NIO connection handler with 10s sessionless connection timeout, 1 selector thread(s), 8 worker
threads, and 64 kB direct buffers.
    [junit] 2017-02-21 09:57:10,506 [myid:] - INFO  [main:NIOServerCnxnFactory@686] - binding
to port 0.0.0.0/0.0.0.0:21998
    [junit] 2017-02-21 09:57:10,507 [myid:] - INFO  [main:ClientBase@361] - STARTING server
instance 127.0.0.1:21998
    [junit] 2017-02-21 09:57:10,507 [myid:] - INFO  [main:ZooKeeperServer@907] - minSessionTimeout
set to 6000
    [junit] 2017-02-21 09:57:10,507 [myid:] - INFO  [main:ZooKeeperServer@916] - maxSessionTimeout
set to 60000
    [junit] 2017-02-21 09:57:10,507 [myid:] - INFO  [main:ZooKeeperServer@159] - Created server
with tickTime 3000 minSessionTimeout 6000 maxSessionTimeout 60000 datadir /home/jenkins/jenkins-slave/workspace/ZooKeeper_branch35_openjdk7/build/test/tmp/test9086588243072711581.junit.dir/version-2
snapdir /home/jenkins/jenkins-slave/workspace/ZooKeeper_branch35_openjdk7/build/test/tmp/test9086588243072711581.junit.dir/version-2
    [junit] 2017-02-21 09:57:10,508 [myid:] - INFO  [main:FileTxnSnapLog@320] - Snapshotting:
0x0 to /home/jenkins/jenkins-slave/workspace/ZooKeeper_branch35_openjdk7/build/test/tmp/test9086588243072711581.junit.dir/version-2/snapshot.0
    [junit] 2017-02-21 09:57:10,508 [myid:] - INFO  [main:FileTxnSnapLog@320] - Snapshotting:
0x0 to /home/jenkins/jenkins-slave/workspace/ZooKeeper_branch35_openjdk7/build/test/tmp/test9086588243072711581.junit.dir/version-2/snapshot.0
    [junit] 2017-02-21 09:57:10,510 [myid:] - ERROR [main:ZooKeeperServer@505] - ZKShutdownHandler
is not registered, so ZooKeeper server won't take any action on ERROR or SHUTDOWN server state
changes
    [junit] 2017-02-21 09:57:10,510 [myid:] - INFO  [main:FourLetterWordMain@85] - connecting
to 127.0.0.1 21998
    [junit] 2017-02-21 09:57:10,510 [myid:] - INFO  [NIOServerCxnFactory.AcceptThread:0.0.0.0/0.0.0.0:21998:NIOServerCnxnFactory$AcceptThread@296]
- Accepted socket connection from /127.0.0.1:53051
    [junit] 2017-02-21 09:57:10,505 [myid:] - INFO  [main:PortAssignment@151] - Test process
6/8 using ports from 24686 - 27378.
    [junit] create [-s] [-e] [-c] path [data] [acl]
    [junit] 2017-02-21 09:57:10,542 [myid:] - INFO  [main:PortAssignment@151] - Test process
2/8 using ports from 13914 - 16606.
    [junit] 2017-02-21 09:57:10,563 [myid:] - INFO  [main:PortAssignment@85] - Assigned port
13915 from range 13914 - 16606.
    [junit] 2017-02-21 09:57:10,537 [myid:] - INFO  [NIOWorkerThread-1:NIOServerCnxn@485]
- Processing stat command from /127.0.0.1:53051
    [junit] 2017-02-21 09:57:10,537 [myid:] - INFO  [NIOWorkerThread-1:StatCommand@49] - Stat
command output
    [junit] 2017-02-21 09:57:10,538 [myid:] - INFO  [NIOWorkerThread-1:NIOServerCnxn@614]
- Closed socket connection for client /127.0.0.1:53051 (no session established for client)
    [junit] 2017-02-21 09:57:10,538 [myid:] - INFO  [main:JMXEnv@228] - ensureParent:[InMemoryDataTree,
StandaloneServer_port]
    [junit] 2017-02-21 09:57:10,540 [myid:] - INFO  [main:JMXEnv@245] - expect:InMemoryDataTree
    [junit] 2017-02-21 09:57:10,541 [myid:] - INFO  [main:JMXEnv@249] - found:InMemoryDataTree
org.apache.ZooKeeperService:name0=StandaloneServer_port21998,name1=InMemoryDataTree
    [junit] 2017-02-21 09:57:10,541 [myid:] - INFO  [main:JMXEnv@245] - expect:StandaloneServer_port
    [junit] 2017-02-21 09:57:10,541 [myid:] - INFO  [main:JMXEnv@249] - found:StandaloneServer_port
org.apache.ZooKeeperService:name0=StandaloneServer_port21998
    [junit] 2017-02-21 09:57:10,541 [myid:] - INFO  [main:ClientBase@462] - Client test setup
finished
    [junit] 2017-02-21 09:57:10,541 [myid:] - INFO  [main:JUnit4ZKTestRunner$LoggedInvokeMethod@77]
- RUNNING TEST METHOD testCreateNodeWithoutData
    [junit] 2017-02-21 09:57:10,542 [myid:] - INFO  [main:ZooKeeper@863] - Initiating client
connection, connectString=127.0.0.1:21998 sessionTimeout=30000 watcher=org.apache.zookeeper.test.ClientBase$CountdownWatcher@7de04525
    [junit] 2017-02-21 09:57:10,542 [myid:] - INFO  [main:ClientCnxnSocket@236] - jute.maxbuffer
value is 4194304 Bytes
    [junit] 2017-02-21 09:57:10,543 [myid:127.0.0.1:21998] - INFO  [main-SendThread(127.0.0.1:21998):ClientCnxn$SendThread@1113]
- Opening socket connection to server 127.0.0.1/127.0.0.1:21998. Will not attempt to authenticate
using SASL (unknown error)
    [junit] 2017-02-21 09:57:10,543 [myid:127.0.0.1:21998] - INFO  [main-SendThread(127.0.0.1:21998):ClientCnxn$SendThread@948]
- Socket connection established, initiating session, client: /127.0.0.1:53052, server: 127.0.0.1/127.0.0.1:21998
    [junit] 2017-02-21 09:57:10,543 [myid:] - INFO  [NIOServerCxnFactory.AcceptThread:0.0.0.0/0.0.0.0:21998:NIOServerCnxnFactory$AcceptThread@296]
- Accepted socket connection from /127.0.0.1:53052
    [junit] 2017-02-21 09:57:10,545 [myid:] - INFO  [NIOWorkerThread-2:ZooKeeperServer@1013]
- Client attempting to establish new session at /127.0.0.1:53052
    [junit] 2017-02-21 09:57:10,566 [myid:] - INFO  [SyncThread:0:FileTxnLog@204] - Creating
new log file: log.1
    [junit] 2017-02-21 09:57:10,580 [myid:] - INFO  [SyncThread:0:ZooKeeperServer@727] - Established
session 0x1022045432c0000 with negotiated timeout 30000 for client /127.0.0.1:53052
    [junit] 2017-02-21 09:57:10,581 [myid:127.0.0.1:21998] - INFO  [main-SendThread(127.0.0.1:21998):ClientCnxn$SendThread@1381]
- Session establishment complete on server 127.0.0.1/127.0.0.1:21998, sessionid = 0x1022045432c0000,
negotiated timeout = 30000
    [junit] 2017-02-21 09:57:10,585 [myid:] - INFO  [main:JMXEnv@117] - expect:0x1022045432c0000
    [junit] 2017-02-21 09:57:10,585 [myid:] - INFO  [main:JMXEnv@120] - found:0x1022045432c0000
org.apache.ZooKeeperService:name0=StandaloneServer_port21998,name1=Connections,name2=127.0.0.1,name3=0x1022045432c0000
    [junit] Created /node0000000000
    [junit] Created /node
    [junit] Created /node0000000002
    [junit] 2017-02-21 09:57:10,546 [myid:] - INFO  [main:PortAssignment@85] - Assigned port
24687 from range 24686 - 27378.
    [junit] 2017-02-21 09:57:10,564 [myid:] - INFO  [main:ZKTestCase$1@55] - STARTING testElapsedTimeToDate
    [junit] 2017-02-21 09:57:10,609 [myid:] - INFO  [main:ClientBase@448] - Initial fdcount
is: 39
Java HotSpot(TM) 64-Bit Server VM warning: INFO: os::commit_memory(0x00000007bff00000, 252706816,
0) failed; error='Cannot allocate memory' (errno=12)
#
# There is insufficient memory for the Java Runtime Environment to continue.
# Native memory allocation (malloc) failed to allocate 252706816 bytes for committing reserved
memory.
# An error report file with more information is saved as:
# /home/jenkins/jenkins-slave/workspace/ZooKeeper_branch35_openjdk7/hs_err_pid12637.log
Build step 'Invoke Ant' marked build as failure
Recording test results
Email was triggered for: Failure - Any
Sending email for trigger: Failure - Any



###################################################################################
############################## FAILED TESTS (if any) ##############################
1 tests failed.
FAILED:  TEST-org.apache.zookeeper.RemoveWatchesCmdTest.xml.[failed-to-read]

Error Message:


Stack Trace:
Failed to read test report file /home/jenkins/jenkins-slave/workspace/ZooKeeper_branch35_openjdk7/build/test/logs/TEST-org.apache.zookeeper.RemoveWatchesCmdTest.xml
org.dom4j.DocumentException: Error on line 51 of document file:///home/jenkins/jenkins-slave/workspace/ZooKeeper_branch35_openjdk7/build/test/logs/TEST-org.apache.zookeeper.RemoveWatchesCmdTest.xml
: XML document structures must start and end within the same entity. Nested exception: XML
document structures must start and end within the same entity.
	at org.dom4j.io.SAXReader.read(SAXReader.java:482)
	at org.dom4j.io.SAXReader.read(SAXReader.java:264)
	at hudson.tasks.junit.SuiteResult.parse(SuiteResult.java:126)
	at hudson.tasks.junit.TestResult.parse(TestResult.java:302)
	at hudson.tasks.junit.TestResult.parsePossiblyEmpty(TestResult.java:244)
	at hudson.tasks.junit.TestResult.parse(TestResult.java:175)
	at hudson.tasks.junit.TestResult.parse(TestResult.java:154)
	at hudson.tasks.junit.TestResult.<init>(TestResult.java:126)
	at hudson.tasks.junit.JUnitParser$ParseResultCallable.invoke(JUnitParser.java:132)
	at hudson.tasks.junit.JUnitParser$ParseResultCallable.invoke(JUnitParser.java:107)
	at hudson.FilePath$FileCallableWrapper.call(FilePath.java:2731)
	at hudson.remoting.UserRequest.perform(UserRequest.java:153)
	at hudson.remoting.UserRequest.perform(UserRequest.java:50)
	at hudson.remoting.Request$2.run(Request.java:336)
	at hudson.remoting.InterceptingExecutorService$1.call(InterceptingExecutorService.java:68)
	at java.util.concurrent.FutureTask.run(FutureTask.java:262)
	at java.util.concurrent.ThreadPoolExecutor.runWorker(ThreadPoolExecutor.java:1145)
	at java.util.concurrent.ThreadPoolExecutor$Worker.run(ThreadPoolExecutor.java:615)
	at java.lang.Thread.run(Thread.java:745)
Caused by: org.xml.sax.SAXParseException; systemId: file:///home/jenkins/jenkins-slave/workspace/ZooKeeper_branch35_openjdk7/build/test/logs/TEST-org.apache.zookeeper.RemoveWatchesCmdTest.xml;
lineNumber: 51; columnNumber: 1; XML document structures must start and end within the same
entity.
	at com.sun.org.apache.xerces.internal.util.ErrorHandlerWrapper.createSAXParseException(ErrorHandlerWrapper.java:198)
	at com.sun.org.apache.xerces.internal.util.ErrorHandlerWrapper.fatalError(ErrorHandlerWrapper.java:177)
	at com.sun.org.apache.xerces.internal.impl.XMLErrorReporter.reportError(XMLErrorReporter.java:441)
	at com.sun.org.apache.xerces.internal.impl.XMLErrorReporter.reportError(XMLErrorReporter.java:368)
	at com.sun.org.apache.xerces.internal.impl.XMLScanner.reportFatalError(XMLScanner.java:1436)
	at com.sun.org.apache.xerces.internal.impl.XMLDocumentFragmentScannerImpl.endEntity(XMLDocumentFragmentScannerImpl.java:903)
	at com.sun.org.apache.xerces.internal.impl.XMLDocumentScannerImpl.endEntity(XMLDocumentScannerImpl.java:563)
	at com.sun.org.apache.xerces.internal.impl.XMLEntityManager.endEntity(XMLEntityManager.java:1384)
	at com.sun.org.apache.xerces.internal.impl.XMLEntityScanner.load(XMLEntityScanner.java:1774)
	at com.sun.org.apache.xerces.internal.impl.XMLEntityScanner.skipChar(XMLEntityScanner.java:1426)
	at com.sun.org.apache.xerces.internal.impl.XMLDocumentFragmentScannerImpl$FragmentContentDriver.next(XMLDocumentFragmentScannerImpl.java:2807)
	at com.sun.org.apache.xerces.internal.impl.XMLDocumentScannerImpl.next(XMLDocumentScannerImpl.java:606)
	at com.sun.org.apache.xerces.internal.impl.XMLNSDocumentScannerImpl.next(XMLNSDocumentScannerImpl.java:117)
	at com.sun.org.apache.xerces.internal.impl.XMLDocumentFragmentScannerImpl.scanDocument(XMLDocumentFragmentScannerImpl.java:510)
	at com.sun.org.apache.xerces.internal.parsers.XML11Configuration.parse(XML11Configuration.java:848)
	at com.sun.org.apache.xerces.internal.parsers.XML11Configuration.parse(XML11Configuration.java:777)
	at com.sun.org.apache.xerces.internal.parsers.XMLParser.parse(XMLParser.java:141)
	at com.sun.org.apache.xerces.internal.parsers.AbstractSAXParser.parse(AbstractSAXParser.java:1213)
	at com.sun.org.apache.xerces.internal.jaxp.SAXParserImpl$JAXPSAXParser.parse(SAXParserImpl.java:649)
	at org.dom4j.io.SAXReader.read(SAXReader.java:465)
	... 18 more
Nested exception: 
org.xml.sax.SAXParseException; systemId: file:///home/jenkins/jenkins-slave/workspace/ZooKeeper_branch35_openjdk7/build/test/logs/TEST-org.apache.zookeeper.RemoveWatchesCmdTest.xml;
lineNumber: 51; columnNumber: 1; XML document structures must start and end within the same
entity.
	at com.sun.org.apache.xerces.internal.util.ErrorHandlerWrapper.createSAXParseException(ErrorHandlerWrapper.java:198)
	at com.sun.org.apache.xerces.internal.util.ErrorHandlerWrapper.fatalError(ErrorHandlerWrapper.java:177)
	at com.sun.org.apache.xerces.internal.impl.XMLErrorReporter.reportError(XMLErrorReporter.java:441)
	at com.sun.org.apache.xerces.internal.impl.XMLErrorReporter.reportError(XMLErrorReporter.java:368)
	at com.sun.org.apache.xerces.internal.impl.XMLScanner.reportFatalError(XMLScanner.java:1436)
	at com.sun.org.apache.xerces.internal.impl.XMLDocumentFragmentScannerImpl.endEntity(XMLDocumentFragmentScannerImpl.java:903)
	at com.sun.org.apache.xerces.internal.impl.XMLDocumentScannerImpl.endEntity(XMLDocumentScannerImpl.java:563)
	at com.sun.org.apache.xerces.internal.impl.XMLEntityManager.endEntity(XMLEntityManager.java:1384)
	at com.sun.org.apache.xerces.internal.impl.XMLEntityScanner.load(XMLEntityScanner.java:1774)
	at com.sun.org.apache.xerces.internal.impl.XMLEntityScanner.skipChar(XMLEntityScanner.java:1426)
	at com.sun.org.apache.xerces.internal.impl.XMLDocumentFragmentScannerImpl$FragmentContentDriver.next(XMLDocumentFragmentScannerImpl.java:2807)
	at com.sun.org.apache.xerces.internal.impl.XMLDocumentScannerImpl.next(XMLDocumentScannerImpl.java:606)
	at com.sun.org.apache.xerces.internal.impl.XMLNSDocumentScannerImpl.next(XMLNSDocumentScannerImpl.java:117)
	at com.sun.org.apache.xerces.internal.impl.XMLDocumentFragmentScannerImpl.scanDocument(XMLDocumentFragmentScannerImpl.java:510)
	at com.sun.org.apache.xerces.internal.parsers.XML11Configuration.parse(XML11Configuration.java:848)
	at com.sun.org.apache.xerces.internal.parsers.XML11Configuration.parse(XML11Configuration.java:777)
	at com.sun.org.apache.xerces.internal.parsers.XMLParser.parse(XMLParser.java:141)
	at com.sun.org.apache.xerces.internal.parsers.AbstractSAXParser.parse(AbstractSAXParser.java:1213)
	at com.sun.org.apache.xerces.internal.jaxp.SAXParserImpl$JAXPSAXParser.parse(SAXParserImpl.java:649)
	at org.dom4j.io.SAXReader.read(SAXReader.java:465)
	at org.dom4j.io.SAXReader.read(SAXReader.java:264)
	at hudson.tasks.junit.SuiteResult.parse(SuiteResult.java:126)
	at hudson.tasks.junit.TestResult.parse(TestResult.java:302)
	at hudson.tasks.junit.TestResult.parsePossiblyEmpty(TestResult.java:244)
	at hudson.tasks.junit.TestResult.parse(TestResult.java:175)
	at hudson.tasks.junit.TestResult.parse(TestResult.java:154)
	at hudson.tasks.junit.TestResult.<init>(TestResult.java:126)
	at hudson.tasks.junit.JUnitParser$ParseResultCallable.invoke(JUnitParser.java:132)
	at hudson.tasks.junit.JUnitParser$ParseResultCallable.invoke(JUnitParser.java:107)
	at hudson.FilePath$FileCallableWrapper.call(FilePath.java:2731)
	at hudson.remoting.UserRequest.perform(UserRequest.java:153)
	at hudson.remoting.UserRequest.perform(UserRequest.java:50)
	at hudson.remoting.Request$2.run(Request.java:336)
	at hudson.remoting.InterceptingExecutorService$1.call(InterceptingExecutorService.java:68)
	at java.util.concurrent.FutureTask.run(FutureTask.java:262)
	at java.util.concurrent.ThreadPoolExecutor.runWorker(ThreadPoolExecutor.java:1145)
	at java.util.concurrent.ThreadPoolExecutor$Worker.run(ThreadPoolExecutor.java:615)
	at java.lang.Thread.run(Thread.java:745)



Mime
  • Unnamed multipart/mixed (inline, None, 0 bytes)
View raw message