zookeeper-dev mailing list archives

Site index · List index
Message view « Date » · « Thread »
Top « Date » · « Thread »
From Apache Jenkins Server <jenk...@builds.apache.org>
Subject ZooKeeper_branch34 - Build # 1829 - Failure
Date Fri, 10 Feb 2017 05:33:43 GMT
See https://builds.apache.org/job/ZooKeeper_branch34/1829/

###################################################################################
########################## LAST 60 LINES OF THE CONSOLE ###########################
[...truncated 242226 lines...]
     [exec] Zookeeper_watchers::testChildWatcher1 : elapsed 300 : OK
     [exec] Zookeeper_watchers::testChildWatcher2 : elapsed 300 : OK
     [exec] OK (35)
     [exec] ./zktest-mt 
     [exec]  ZooKeeper server started
     [exec] Running 
     [exec] Zookeeper_clientretry::testRetry ZooKeeper server started ZooKeeper server started
: elapsed 9168 : OK
     [exec] Zookeeper_operations::testAsyncWatcher1 : elapsed 54 : OK
     [exec] Zookeeper_operations::testAsyncGetOperation : elapsed 3 : OK
     [exec] Zookeeper_operations::testOperationsAndDisconnectConcurrently1 : elapsed 382 :
OK
     [exec] Zookeeper_operations::testOperationsAndDisconnectConcurrently2 : elapsed 0 : OK
     [exec] Zookeeper_operations::testConcurrentOperations1 : elapsed 3964 : OK
     [exec] Zookeeper_init::testBasic : elapsed 0 : OK
     [exec] Zookeeper_init::testAddressResolution : elapsed 0 : OK
     [exec] Zookeeper_init::testMultipleAddressResolution : elapsed 0 : OK
     [exec] Zookeeper_init::testNullAddressString : elapsed 0 : OK
     [exec] Zookeeper_init::testEmptyAddressString : elapsed 0 : OK
     [exec] Zookeeper_init::testOneSpaceAddressString : elapsed 0 : OK
     [exec] Zookeeper_init::testTwoSpacesAddressString : elapsed 0 : OK
     [exec] Zookeeper_init::testInvalidAddressString1 : elapsed 0 : OK
     [exec] Zookeeper_init::testInvalidAddressString2 : elapsed 33 : OK
     [exec] Zookeeper_init::testNonexistentHost : elapsed 12 : OK
     [exec] Zookeeper_init::testOutOfMemory_init : elapsed 0 : OK
     [exec] Zookeeper_init::testOutOfMemory_getaddrs1 : elapsed 0 : OK
     [exec] Zookeeper_init::testOutOfMemory_getaddrs2 : elapsed 0 : OK
     [exec] Zookeeper_init::testPermuteAddrsList : elapsed 0 : OK
     [exec] Zookeeper_close::testIOThreadStoppedOnExpire : elapsed 260 : OK
     [exec] Zookeeper_close::testCloseUnconnected : elapsed 0 : OK
     [exec] Zookeeper_close::testCloseUnconnected1 : elapsed 46 : OK
     [exec] Zookeeper_close::testCloseConnected1 : elapsed 236 : OK
     [exec] Zookeeper_close::testCloseFromWatcher1 : elapsed 256 : OK
     [exec] Zookeeper_simpleSystem::testAsyncWatcherAutoReset ZooKeeper server started : elapsed
12094 : OK
     [exec] Zookeeper_simpleSystem::testDeserializeString : elapsed 0 : OK
     [exec] Zookeeper_simpleSystem::testFirstServerDown : elapsed 1001 : OK
     [exec] Zookeeper_simpleSystem::testNullData : elapsed 1017 : OK
     [exec] Zookeeper_simpleSystem::testIPV6 : elapsed 1002 : OK
     [exec] Zookeeper_simpleSystem::testPath : elapsed 1008 : OK
     [exec] Zookeeper_simpleSystem::testPathValidation : elapsed 1031 : OK
     [exec] Zookeeper_simpleSystem::testPing : elapsed 17113 : OK
     [exec] Zookeeper_simpleSystem::testAcl : elapsed 1009 : OK
     [exec] Zookeeper_simpleSystem::testChroot : elapsed 3023 : OK
     [exec] terminate called after throwing an instance of 'CppUnit::Exception'
     [exec]   what():  equality assertion failed
     [exec] - Expected: 0
     [exec] - Actual  : -116
     [exec] 
     [exec] make: *** [run-check] Aborted (core dumped)
     [exec] Zookeeper_simpleSystem::testAuth

BUILD FAILED
/home/jenkins/jenkins-slave/workspace/ZooKeeper_branch34/build.xml:1420: The following error
occurred while executing this line:
/home/jenkins/jenkins-slave/workspace/ZooKeeper_branch34/build.xml:1380: The following error
occurred while executing this line:
/home/jenkins/jenkins-slave/workspace/ZooKeeper_branch34/build.xml:1390: exec returned: 2

Total time: 30 minutes 19 seconds
Build step 'Execute shell' marked build as failure
Recording test results
Email was triggered for: Failure - Any
Sending email for trigger: Failure - Any



###################################################################################
############################## FAILED TESTS (if any) ##############################
All tests passed
Mime
  • Unnamed multipart/mixed (inline, None, 0 bytes)
View raw message