zookeeper-dev mailing list archives

Site index · List index
Message view « Date » · « Thread »
Top « Date » · « Thread »
From Apache Jenkins Server <jenk...@builds.apache.org>
Subject Failed: ZOOKEEPER- PreCommit Build #274
Date Wed, 01 Feb 2017 15:39:09 GMT
Build: https://builds.apache.org/job/PreCommit-ZOOKEEPER-github-pr-build/274/

###################################################################################
########################## LAST 60 LINES OF THE CONSOLE ###########################
[...truncated 482110 lines...]
     [exec] 
     [exec]     +1 javadoc.  The javadoc tool did not generate any warning messages.
     [exec] 
     [exec]     +1 javac.  The applied patch does not increase the total number of javac compiler
warnings.
     [exec] 
     [exec]     +1 findbugs.  The patch does not introduce any new Findbugs (version 3.0.1)
warnings.
     [exec] 
     [exec]     +1 release audit.  The applied patch does not increase the total number of
release audit warnings.
     [exec] 
     [exec]     -1 core tests.  The patch failed core unit tests.
     [exec] 
     [exec]     +1 contrib tests.  The patch passed contrib unit tests.
     [exec] 
     [exec] Test results: https://builds.apache.org/job/PreCommit-ZOOKEEPER-github-pr-build/274//testReport/
     [exec] Findbugs warnings: https://builds.apache.org/job/PreCommit-ZOOKEEPER-github-pr-build/274//artifact/trunk/build/test/findbugs/newPatchFindbugsWarnings.html
     [exec] Console output: https://builds.apache.org/job/PreCommit-ZOOKEEPER-github-pr-build/274//console
     [exec] 
     [exec] This message is automatically generated.
     [exec] 
     [exec] 
     [exec] ======================================================================
     [exec] ======================================================================
     [exec]     Adding comment to Jira.
     [exec] ======================================================================
     [exec] ======================================================================
     [exec] 
     [exec] 
     [exec] Comment added.
     [exec] 37bad7b62804401fa915504ad6fc28588cad8549 logged out
     [exec] 
     [exec] 
     [exec] ======================================================================
     [exec] ======================================================================
     [exec]     Finished build.
     [exec] ======================================================================
     [exec] ======================================================================
     [exec] 
     [exec] 
     [exec] mv: '/home/jenkins/jenkins-slave/workspace/PreCommit-ZOOKEEPER-github-pr-build/patchprocess'
and '/home/jenkins/jenkins-slave/workspace/PreCommit-ZOOKEEPER-github-pr-build/patchprocess'
are the same file

BUILD FAILED
/home/jenkins/jenkins-slave/workspace/PreCommit-ZOOKEEPER-github-pr-build/build.xml:1630:
exec returned: 1

Total time: 18 minutes 53 seconds
Build step 'Execute shell' marked build as failure
Archiving artifacts
Setting JDK_1_7_LATEST__HOME=/home/jenkins/tools/java/latest1.7
Compressed 575.40 KB of artifacts by 27.8% relative to #273
Recording test results
Setting JDK_1_7_LATEST__HOME=/home/jenkins/tools/java/latest1.7
Setting JDK_1_7_LATEST__HOME=/home/jenkins/tools/java/latest1.7
[description-setter] Description set: ZOOKEEPER-2680
Putting comment on the pull request
Setting JDK_1_7_LATEST__HOME=/home/jenkins/tools/java/latest1.7
Email was triggered for: Failure - Any
Sending email for trigger: Failure - Any
Setting JDK_1_7_LATEST__HOME=/home/jenkins/tools/java/latest1.7
Setting JDK_1_7_LATEST__HOME=/home/jenkins/tools/java/latest1.7
Setting JDK_1_7_LATEST__HOME=/home/jenkins/tools/java/latest1.7



###################################################################################
############################## FAILED TESTS (if any) ##############################
3 tests failed.
FAILED:  org.apache.zookeeper.server.CRCTest.testChecksums

Error Message:
null

Stack Trace:
java.io.EOFException
	at java.io.DataInputStream.readInt(DataInputStream.java:392)
	at org.apache.jute.BinaryInputArchive.readString(BinaryInputArchive.java:79)
	at org.apache.zookeeper.server.DataTree.deserialize(DataTree.java:1222)
	at org.apache.zookeeper.server.util.SerializeUtils.deserializeSnapshot(SerializeUtils.java:137)
	at org.apache.zookeeper.server.persistence.FileSnap.deserialize(FileSnap.java:127)
	at org.apache.zookeeper.server.CRCTest.getCheckSum(CRCTest.java:82)
	at org.apache.zookeeper.server.CRCTest.testChecksums(CRCTest.java:171)
	at org.apache.zookeeper.JUnit4ZKTestRunner$LoggedInvokeMethod.evaluate(JUnit4ZKTestRunner.java:79)


FAILED:  org.apache.zookeeper.server.InvalidSnapshotTest.testInvalidSnapshot

Error Message:
No snapshot found, but there are log entries. Something is broken!

Stack Trace:
java.io.IOException: No snapshot found, but there are log entries. Something is broken!
	at org.apache.zookeeper.server.persistence.FileTxnSnapLog.restore(FileTxnSnapLog.java:191)
	at org.apache.zookeeper.server.ZKDatabase.loadDataBase(ZKDatabase.java:225)
	at org.apache.zookeeper.server.ZooKeeperServer.loadData(ZooKeeperServer.java:284)
	at org.apache.zookeeper.server.ZooKeeperServer.startdata(ZooKeeperServer.java:444)
	at org.apache.zookeeper.server.NIOServerCnxnFactory.startup(NIOServerCnxnFactory.java:764)
	at org.apache.zookeeper.server.ServerCnxnFactory.startup(ServerCnxnFactory.java:98)
	at org.apache.zookeeper.test.ClientBase.startServerInstance(ClientBase.java:378)
	at org.apache.zookeeper.test.ClientBase.startServer(ClientBase.java:484)
	at org.apache.zookeeper.server.InvalidSnapshotTest.testInvalidSnapshot(InvalidSnapshotTest.java:73)
	at org.apache.zookeeper.JUnit4ZKTestRunner$LoggedInvokeMethod.evaluate(JUnit4ZKTestRunner.java:79)


FAILED:  org.apache.zookeeper.server.quorum.Zab1_0Test.testNormalObserverRun

Error Message:
Timeout occurred. Please note the time in the report does not reflect the time until the timeout.

Stack Trace:
junit.framework.AssertionFailedError: Timeout occurred. Please note the time in the report
does not reflect the time until the timeout.
	at java.lang.Thread.run(Thread.java:745)



Mime
  • Unnamed multipart/mixed (inline, None, 0 bytes)
View raw message