zookeeper-dev mailing list archives

Site index · List index
Message view « Date » · « Thread »
Top « Date » · « Thread »
From Apache Jenkins Server <jenk...@builds.apache.org>
Subject ZooKeeper_branch35_openjdk7 - Build # 407 - Failure
Date Fri, 10 Feb 2017 06:25:32 GMT
See https://builds.apache.org/job/ZooKeeper_branch35_openjdk7/407/

###################################################################################
########################## LAST 60 LINES OF THE CONSOLE ###########################
[...truncated 479727 lines...]
    [junit] 	at sun.nio.ch.SocketChannelImpl.checkConnect(Native Method)
    [junit] 	at sun.nio.ch.SocketChannelImpl.finishConnect(SocketChannelImpl.java:739)
    [junit] 	at org.apache.zookeeper.ClientCnxnSocketNIO.doTransport(ClientCnxnSocketNIO.java:357)
    [junit] 	at org.apache.zookeeper.ClientCnxn$SendThread.run(ClientCnxn.java:1214)
    [junit] 2017-02-10 06:25:13,471 [myid:] - INFO  [ProcessThread(sid:0 cport:16854)::PrepRequestProcessor@656]
- Processed session termination for sessionid: 0x101e6dd2da20000
    [junit] 2017-02-10 06:25:13,475 [myid:] - WARN  [New I/O worker #1829:NettyServerCnxnFactory$CnxnChannelHandler@142]
- Exception caught [id: 0xf6db87d0, /127.0.0.1:50334 :> /127.0.0.1:16854] EXCEPTION: java.nio.channels.ClosedChannelException
    [junit] java.nio.channels.ClosedChannelException
    [junit] 	at sun.nio.ch.SocketChannelImpl.ensureWriteOpen(SocketChannelImpl.java:265)
    [junit] 	at sun.nio.ch.SocketChannelImpl.write(SocketChannelImpl.java:474)
    [junit] 	at org.jboss.netty.channel.socket.nio.SocketSendBufferPool$UnpooledSendBuffer.transferTo(SocketSendBufferPool.java:203)
    [junit] 	at org.jboss.netty.channel.socket.nio.AbstractNioWorker.write0(AbstractNioWorker.java:201)
    [junit] 	at org.jboss.netty.channel.socket.nio.AbstractNioWorker.writeFromTaskLoop(AbstractNioWorker.java:151)
    [junit] 	at org.jboss.netty.channel.socket.nio.AbstractNioChannel$WriteTask.run(AbstractNioChannel.java:315)
    [junit] 	at org.jboss.netty.channel.socket.nio.AbstractNioSelector.processTaskQueue(AbstractNioSelector.java:391)
    [junit] 	at org.jboss.netty.channel.socket.nio.AbstractNioSelector.run(AbstractNioSelector.java:315)
    [junit] 	at org.jboss.netty.channel.socket.nio.AbstractNioWorker.run(AbstractNioWorker.java:89)
    [junit] 	at org.jboss.netty.channel.socket.nio.NioWorker.run(NioWorker.java:178)
    [junit] 	at org.jboss.netty.util.ThreadRenamingRunnable.run(ThreadRenamingRunnable.java:108)
    [junit] 	at org.jboss.netty.util.internal.DeadLockProofWorker$1.run(DeadLockProofWorker.java:42)
    [junit] 	at java.util.concurrent.ThreadPoolExecutor.runWorker(ThreadPoolExecutor.java:1145)
    [junit] 	at java.util.concurrent.ThreadPoolExecutor$Worker.run(ThreadPoolExecutor.java:615)
    [junit] 	at java.lang.Thread.run(Thread.java:745)
    [junit] 2017-02-10 06:25:13,475 [myid:] - INFO  [SyncThread:0:MBeanRegistry@128] - Unregister
MBean [org.apache.ZooKeeperService:name0=StandaloneServer_port16854,name1=Connections,name2=127.0.0.1,name3=0x101e6dd2da20000]
    [junit] 2017-02-10 06:25:13,576 [myid:] - INFO  [main:ZooKeeper@1322] - Session: 0x101e6dd2da20000
closed
    [junit] 2017-02-10 06:25:13,576 [myid:] - INFO  [main-EventThread:ClientCnxn$EventThread@513]
- EventThread shut down for session: 0x101e6dd2da20000
    [junit] 2017-02-10 06:25:13,576 [myid:] - INFO  [main:JUnit4ZKTestRunner$LoggedInvokeMethod@82]
- Memory used 79853
    [junit] 2017-02-10 06:25:13,577 [myid:] - INFO  [main:JUnit4ZKTestRunner$LoggedInvokeMethod@87]
- Number of threads 466
    [junit] 2017-02-10 06:25:13,577 [myid:] - INFO  [main:JUnit4ZKTestRunner$LoggedInvokeMethod@102]
- FINISHED TEST METHOD testWatcherAutoResetWithLocal
    [junit] 2017-02-10 06:25:13,577 [myid:] - INFO  [main:ClientBase@543] - tearDown starting
    [junit] 2017-02-10 06:25:13,577 [myid:] - INFO  [main:ClientBase@513] - STOPPING server
    [junit] 2017-02-10 06:25:13,577 [myid:] - INFO  [main:NettyServerCnxnFactory@464] - shutdown
called 0.0.0.0/0.0.0.0:16854
    [junit] 2017-02-10 06:25:13,581 [myid:] - INFO  [main:ZooKeeperServer@533] - shutting
down
    [junit] 2017-02-10 06:25:13,582 [myid:] - ERROR [main:ZooKeeperServer@505] - ZKShutdownHandler
is not registered, so ZooKeeper server won't take any action on ERROR or SHUTDOWN server state
changes
    [junit] 2017-02-10 06:25:13,582 [myid:] - INFO  [main:SessionTrackerImpl@232] - Shutting
down
    [junit] 2017-02-10 06:25:13,582 [myid:] - INFO  [main:PrepRequestProcessor@974] - Shutting
down
    [junit] 2017-02-10 06:25:13,582 [myid:] - INFO  [main:SyncRequestProcessor@191] - Shutting
down
    [junit] 2017-02-10 06:25:13,582 [myid:] - INFO  [ProcessThread(sid:0 cport:16854)::PrepRequestProcessor@154]
- PrepRequestProcessor exited loop!
    [junit] 2017-02-10 06:25:13,583 [myid:] - INFO  [main:FinalRequestProcessor@479] - shutdown
of request processor complete
    [junit] 2017-02-10 06:25:13,583 [myid:] - INFO  [SyncThread:0:SyncRequestProcessor@169]
- SyncRequestProcessor exited!
    [junit] 2017-02-10 06:25:13,584 [myid:] - INFO  [main:MBeanRegistry@128] - Unregister
MBean [org.apache.ZooKeeperService:name0=StandaloneServer_port16854,name1=InMemoryDataTree]
    [junit] 2017-02-10 06:25:13,584 [myid:] - INFO  [main:MBeanRegistry@128] - Unregister
MBean [org.apache.ZooKeeperService:name0=StandaloneServer_port16854]
    [junit] 2017-02-10 06:25:13,585 [myid:] - INFO  [main:FourLetterWordMain@85] - connecting
to 127.0.0.1 16854
    [junit] 2017-02-10 06:25:13,585 [myid:] - INFO  [main:JMXEnv@146] - ensureOnly:[]
    [junit] 2017-02-10 06:25:13,593 [myid:] - INFO  [main:ClientBase@568] - fdcount after
test is: 1368 at start it was 1368
    [junit] 2017-02-10 06:25:13,593 [myid:] - INFO  [main:ZKTestCase$1@65] - SUCCEEDED testWatcherAutoResetWithLocal
    [junit] 2017-02-10 06:25:13,593 [myid:] - INFO  [main:ZKTestCase$1@60] - FINISHED testWatcherAutoResetWithLocal
    [junit] Tests run: 103, Failures: 0, Errors: 0, Skipped: 0, Time elapsed: 451.493 sec,
Thread: 3, Class: org.apache.zookeeper.test.NioNettySuiteTest

fail.build.on.test.failure:

BUILD FAILED
/home/jenkins/jenkins-slave/workspace/ZooKeeper_branch35_openjdk7/build.xml:1211: The following
error occurred while executing this line:
/home/jenkins/jenkins-slave/workspace/ZooKeeper_branch35_openjdk7/build.xml:1215: Tests failed!

Total time: 11 minutes 33 seconds
Build step 'Invoke Ant' marked build as failure
Recording test results
Email was triggered for: Failure - Any
Sending email for trigger: Failure - Any



###################################################################################
############################## FAILED TESTS (if any) ##############################
1 tests failed.
FAILED:  org.apache.zookeeper.server.quorum.StandaloneDisabledTest.startSingleServerTest

Error Message:
client could not connect to reestablished quorum: giving up after 30+ seconds.

Stack Trace:
junit.framework.AssertionFailedError: client could not connect to reestablished quorum: giving
up after 30+ seconds.
	at org.apache.zookeeper.test.ReconfigTest.reconfig(ReconfigTest.java:93)
	at org.apache.zookeeper.server.quorum.StandaloneDisabledTest.testReconfig(StandaloneDisabledTest.java:233)
	at org.apache.zookeeper.server.quorum.StandaloneDisabledTest.startSingleServerTest(StandaloneDisabledTest.java:109)
	at org.apache.zookeeper.JUnit4ZKTestRunner$LoggedInvokeMethod.evaluate(JUnit4ZKTestRunner.java:79)



Mime
  • Unnamed multipart/mixed (inline, None, 0 bytes)
View raw message