zookeeper-dev mailing list archives

Site index · List index
Message view « Date » · « Thread »
Top « Date » · « Thread »
From Apache Jenkins Server <jenk...@builds.apache.org>
Subject ZooKeeper-trunk-jdk8 - Build # 926 - Still Failing
Date Sun, 05 Feb 2017 07:18:59 GMT
See https://builds.apache.org/job/ZooKeeper-trunk-jdk8/926/

###################################################################################
########################## LAST 60 LINES OF THE CONSOLE ###########################
[...truncated 534791 lines...]
    [junit] 	at org.jboss.netty.channel.SimpleChannelHandler.handleDownstream(SimpleChannelHandler.java:260)
    [junit] 	at org.jboss.netty.channel.DefaultChannelPipeline.sendDownstream(DefaultChannelPipeline.java:591)
    [junit] 	at org.jboss.netty.channel.DefaultChannelPipeline.sendDownstream(DefaultChannelPipeline.java:582)
    [junit] 	at org.jboss.netty.channel.Channels.close(Channels.java:812)
    [junit] 	at org.jboss.netty.channel.AbstractChannel.close(AbstractChannel.java:206)
    [junit] 	at org.apache.zookeeper.server.NettyServerCnxn.close(NettyServerCnxn.java:111)
    [junit] 	at org.apache.zookeeper.server.NettyServerCnxn.sendBuffer(NettyServerCnxn.java:215)
    [junit] 	at org.apache.zookeeper.server.NettyServerCnxn.sendCloseSession(NettyServerCnxn.java:441)
    [junit] 	at org.apache.zookeeper.server.FinalRequestProcessor.processRequest(FinalRequestProcessor.java:461)
    [junit] 	at org.apache.zookeeper.server.SyncRequestProcessor.flush(SyncRequestProcessor.java:182)
    [junit] 	at org.apache.zookeeper.server.SyncRequestProcessor.run(SyncRequestProcessor.java:113)
    [junit] 2017-02-05 07:18:01,438 [myid:127.0.0.1:16608] - INFO  [main-SendThread(127.0.0.1:16608):ClientCnxn$SendThread@1113]
- Opening socket connection to server 127.0.0.1/127.0.0.1:16608. Will not attempt to authenticate
using SASL (unknown error)
    [junit] 2017-02-05 07:18:01,439 [myid:127.0.0.1:16608] - WARN  [main-SendThread(127.0.0.1:16608):ClientCnxn$SendThread@1235]
- Session 0x10224a374fa0000 for server 127.0.0.1/127.0.0.1:16608, unexpected error, closing
socket connection and attempting reconnect
    [junit] java.net.ConnectException: Connection refused
    [junit] 	at sun.nio.ch.SocketChannelImpl.checkConnect(Native Method)
    [junit] 	at sun.nio.ch.SocketChannelImpl.finishConnect(SocketChannelImpl.java:717)
    [junit] 	at org.apache.zookeeper.ClientCnxnSocketNIO.doTransport(ClientCnxnSocketNIO.java:357)
    [junit] 	at org.apache.zookeeper.ClientCnxn$SendThread.run(ClientCnxn.java:1214)
    [junit] 2017-02-05 07:18:01,486 [myid:] - INFO  [main:ZooKeeper@1324] - Session: 0x10224adc6a60000
closed
    [junit] 2017-02-05 07:18:01,486 [myid:] - INFO  [main:JUnit4ZKTestRunner$LoggedInvokeMethod@82]
- Memory used 144128
    [junit] 2017-02-05 07:18:01,486 [myid:] - INFO  [main:JUnit4ZKTestRunner$LoggedInvokeMethod@87]
- Number of threads 1643
    [junit] 2017-02-05 07:18:01,487 [myid:] - INFO  [main:JUnit4ZKTestRunner$LoggedInvokeMethod@102]
- FINISHED TEST METHOD testWatcherAutoResetWithLocal
    [junit] 2017-02-05 07:18:01,487 [myid:] - INFO  [main:ClientBase@558] - tearDown starting
    [junit] 2017-02-05 07:18:01,487 [myid:] - INFO  [main:ClientBase@528] - STOPPING server
    [junit] 2017-02-05 07:18:01,487 [myid:] - INFO  [main:NettyServerCnxnFactory@464] - shutdown
called 0.0.0.0/0.0.0.0:16854
    [junit] 2017-02-05 07:18:01,486 [myid:] - INFO  [main-EventThread:ClientCnxn$EventThread@513]
- EventThread shut down for session: 0x10224adc6a60000
    [junit] 2017-02-05 07:18:01,493 [myid:] - INFO  [main:ZooKeeperServer@534] - shutting
down
    [junit] 2017-02-05 07:18:01,493 [myid:] - ERROR [main:ZooKeeperServer@506] - ZKShutdownHandler
is not registered, so ZooKeeper server won't take any action on ERROR or SHUTDOWN server state
changes
    [junit] 2017-02-05 07:18:01,493 [myid:] - INFO  [main:SessionTrackerImpl@232] - Shutting
down
    [junit] 2017-02-05 07:18:01,493 [myid:] - INFO  [main:PrepRequestProcessor@1008] - Shutting
down
    [junit] 2017-02-05 07:18:01,493 [myid:] - INFO  [main:SyncRequestProcessor@191] - Shutting
down
    [junit] 2017-02-05 07:18:01,493 [myid:] - INFO  [ProcessThread(sid:0 cport:16854)::PrepRequestProcessor@157]
- PrepRequestProcessor exited loop!
    [junit] 2017-02-05 07:18:01,493 [myid:] - INFO  [SyncThread:0:SyncRequestProcessor@169]
- SyncRequestProcessor exited!
    [junit] 2017-02-05 07:18:01,494 [myid:] - INFO  [main:FinalRequestProcessor@481] - shutdown
of request processor complete
    [junit] 2017-02-05 07:18:01,494 [myid:] - INFO  [main:MBeanRegistry@128] - Unregister
MBean [org.apache.ZooKeeperService:name0=StandaloneServer_port16854,name1=InMemoryDataTree]
    [junit] 2017-02-05 07:18:01,494 [myid:] - INFO  [main:MBeanRegistry@128] - Unregister
MBean [org.apache.ZooKeeperService:name0=StandaloneServer_port16854]
    [junit] 2017-02-05 07:18:01,494 [myid:] - INFO  [main:FourLetterWordMain@85] - connecting
to 127.0.0.1 16854
    [junit] 2017-02-05 07:18:01,495 [myid:] - INFO  [main:JMXEnv@146] - ensureOnly:[]
    [junit] 2017-02-05 07:18:01,499 [myid:] - INFO  [main:ClientBase@583] - fdcount after
test is: 4828 at start it was 4832
    [junit] 2017-02-05 07:18:01,499 [myid:] - INFO  [main:ZKTestCase$1@65] - SUCCEEDED testWatcherAutoResetWithLocal
    [junit] 2017-02-05 07:18:01,499 [myid:] - INFO  [main:ZKTestCase$1@60] - FINISHED testWatcherAutoResetWithLocal
    [junit] Tests run: 103, Failures: 0, Errors: 0, Skipped: 0, Time elapsed: 682.614 sec,
Thread: 3, Class: org.apache.zookeeper.test.NioNettySuiteTest
    [junit] 2017-02-05 07:18:01,738 [myid:127.0.0.1:16731] - INFO  [main-SendThread(127.0.0.1:16731):ClientCnxn$SendThread@1113]
- Opening socket connection to server 127.0.0.1/127.0.0.1:16731. Will not attempt to authenticate
using SASL (unknown error)
    [junit] 2017-02-05 07:18:01,738 [myid:127.0.0.1:16731] - WARN  [main-SendThread(127.0.0.1:16731):ClientCnxn$SendThread@1235]
- Session 0x10224a9792e0000 for server 127.0.0.1/127.0.0.1:16731, unexpected error, closing
socket connection and attempting reconnect
    [junit] java.net.ConnectException: Connection refused
    [junit] 	at sun.nio.ch.SocketChannelImpl.checkConnect(Native Method)
    [junit] 	at sun.nio.ch.SocketChannelImpl.finishConnect(SocketChannelImpl.java:717)
    [junit] 	at org.apache.zookeeper.ClientCnxnSocketNIO.doTransport(ClientCnxnSocketNIO.java:357)
    [junit] 	at org.apache.zookeeper.ClientCnxn$SendThread.run(ClientCnxn.java:1214)

BUILD FAILED
/home/jenkins/jenkins-slave/workspace/ZooKeeper-trunk-jdk8/build.xml:1211: Tests failed!

Total time: 16 minutes 27 seconds
Build step 'Invoke Ant' marked build as failure
[WARNINGS] Skipping publisher since build result is FAILURE
Recording test results
Email was triggered for: Failure - Any
Sending email for trigger: Failure - Any



###################################################################################
############################## FAILED TESTS (if any) ##############################
6 tests failed.
FAILED:  org.apache.zookeeper.server.quorum.ReconfigDuringLeaderSyncTest.testDuringLeaderSync

Error Message:
zoo.cfg.dynamic.next is not deleted.

Stack Trace:
junit.framework.AssertionFailedError: zoo.cfg.dynamic.next is not deleted.
	at org.apache.zookeeper.server.quorum.ReconfigDuringLeaderSyncTest.testDuringLeaderSync(ReconfigDuringLeaderSyncTest.java:165)
	at org.apache.zookeeper.JUnit4ZKTestRunner$LoggedInvokeMethod.evaluate(JUnit4ZKTestRunner.java:79)


FAILED:  org.apache.zookeeper.test.ReconfigTest.testQuorumSystemChange

Error Message:
KeeperErrorCode = Session expired

Stack Trace:
org.apache.zookeeper.KeeperException$SessionExpiredException: KeeperErrorCode = Session expired
	at org.apache.zookeeper.KeeperException.create(KeeperException.java:131)
	at org.apache.zookeeper.KeeperException.create(KeeperException.java:51)
	at org.apache.zookeeper.admin.ZooKeeperAdmin.reconfig(ZooKeeperAdmin.java:183)
	at org.apache.zookeeper.admin.ZooKeeperAdmin.reconfig(ZooKeeperAdmin.java:200)
	at org.apache.zookeeper.test.ReconfigTest.reconfig(ReconfigTest.java:84)
	at org.apache.zookeeper.test.ReconfigTest.testQuorumSystemChange(ReconfigTest.java:871)
	at org.apache.zookeeper.JUnit4ZKTestRunner$LoggedInvokeMethod.evaluate(JUnit4ZKTestRunner.java:79)


FAILED:  org.apache.zookeeper.test.ReconfigTest.testRemoveAddTwo

Error Message:
KeeperErrorCode = Session expired for /dummy

Stack Trace:
org.apache.zookeeper.KeeperException$SessionExpiredException: KeeperErrorCode = Session expired
for /dummy
	at org.apache.zookeeper.KeeperException.create(KeeperException.java:131)
	at org.apache.zookeeper.KeeperException.create(KeeperException.java:51)
	at org.apache.zookeeper.ZooKeeper.create(ZooKeeper.java:1424)
	at org.apache.zookeeper.test.ReconfigTest.createZNode(ReconfigTest.java:192)
	at org.apache.zookeeper.test.ReconfigTest.testNormalOperation(ReconfigTest.java:165)
	at org.apache.zookeeper.test.ReconfigTest.testRemoveAddTwo(ReconfigTest.java:424)
	at org.apache.zookeeper.JUnit4ZKTestRunner$LoggedInvokeMethod.evaluate(JUnit4ZKTestRunner.java:79)


FAILED:  org.apache.zookeeper.test.WatcherTest.testWatchAutoResetWithPending

Error Message:
For 5 expected:<1> but was:<0>

Stack Trace:
junit.framework.AssertionFailedError: For 5 expected:<1> but was:<0>
	at org.apache.zookeeper.test.WatcherTest.testWatchAutoResetWithPending(WatcherTest.java:211)
	at org.apache.zookeeper.JUnit4ZKTestRunner$LoggedInvokeMethod.evaluate(JUnit4ZKTestRunner.java:79)


FAILED:  org.apache.zookeeper.test.QuorumZxidSyncTest.testLateLogs

Error Message:
waiting for server up

Stack Trace:
junit.framework.AssertionFailedError: waiting for server up
	at org.apache.zookeeper.test.QuorumBase.startServers(QuorumBase.java:223)
	at org.apache.zookeeper.test.QuorumBase.startServers(QuorumBase.java:132)
	at org.apache.zookeeper.test.QuorumZxidSyncTest.testLateLogs(QuorumZxidSyncTest.java:121)
	at org.apache.zookeeper.JUnit4ZKTestRunner$LoggedInvokeMethod.evaluate(JUnit4ZKTestRunner.java:79)


FAILED:  org.apache.zookeeper.test.FourLetterWordsQuorumTest.testFourLetterWords

Error Message:
Exception while executing four letter word: conf

Stack Trace:
java.io.IOException: Exception while executing four letter word: conf
	at org.apache.zookeeper.client.FourLetterWordMain.send4LetterWord(FourLetterWordMain.java:124)
	at org.apache.zookeeper.client.FourLetterWordMain.send4LetterWord(FourLetterWordMain.java:54)
	at org.apache.zookeeper.test.FourLetterWordsQuorumTest.verify(FourLetterWordsQuorumTest.java:109)
	at org.apache.zookeeper.test.FourLetterWordsQuorumTest.testFourLetterWords(FourLetterWordsQuorumTest.java:84)
	at org.apache.zookeeper.JUnit4ZKTestRunner$LoggedInvokeMethod.evaluate(JUnit4ZKTestRunner.java:79)
Caused by: java.net.SocketTimeoutException: Read timed out
	at java.net.SocketInputStream.socketRead0(Native Method)
	at java.net.SocketInputStream.socketRead(SocketInputStream.java:116)
	at java.net.SocketInputStream.read(SocketInputStream.java:170)
	at java.net.SocketInputStream.read(SocketInputStream.java:141)
	at sun.nio.cs.StreamDecoder.readBytes(StreamDecoder.java:284)
	at sun.nio.cs.StreamDecoder.implRead(StreamDecoder.java:326)
	at sun.nio.cs.StreamDecoder.read(StreamDecoder.java:178)
	at java.io.InputStreamReader.read(InputStreamReader.java:184)
	at java.io.BufferedReader.fill(BufferedReader.java:161)
	at java.io.BufferedReader.readLine(BufferedReader.java:324)
	at java.io.BufferedReader.readLine(BufferedReader.java:389)
	at org.apache.zookeeper.client.FourLetterWordMain.send4LetterWord(FourLetterWordMain.java:119)



Mime
  • Unnamed multipart/mixed (inline, None, 0 bytes)
View raw message