zookeeper-dev mailing list archives

Site index · List index
Message view « Date » · « Thread »
Top « Date » · « Thread »
From Apache Jenkins Server <jenk...@builds.apache.org>
Subject ZooKeeper_branch34_solaris - Build # 1467 - Still Failing
Date Sat, 11 Feb 2017 13:29:15 GMT
See https://builds.apache.org/job/ZooKeeper_branch34_solaris/1467/

###################################################################################
########################## LAST 60 LINES OF THE CONSOLE ###########################
[...truncated 2955 lines...]
    [junit] 2017-02-11 13:30:42,610 [myid:] - INFO  [main:SyncRequestProcessor@208] - Shutting
down
    [junit] 2017-02-11 13:30:42,610 [myid:] - INFO  [ProcessThread(sid:0 cport:11221)::PrepRequestProcessor@143]
- PrepRequestProcessor exited loop!
    [junit] 2017-02-11 13:30:42,610 [myid:] - INFO  [SyncThread:0:SyncRequestProcessor@186]
- SyncRequestProcessor exited!
    [junit] 2017-02-11 13:30:42,611 [myid:] - INFO  [main:FinalRequestProcessor@402] - shutdown
of request processor complete
    [junit] 2017-02-11 13:30:42,611 [myid:] - INFO  [main:FourLetterWordMain@62] - connecting
to 127.0.0.1 11221
    [junit] 2017-02-11 13:30:42,614 [myid:] - INFO  [main:ZooKeeperServer@173] - Created server
with tickTime 3000 minSessionTimeout 6000 maxSessionTimeout 60000 datadir /zonestorage/hudson_solaris/home/hudson/hudson-slave/workspace/ZooKeeper_branch34_solaris/build/test/tmp/test2614513272421559936.junit.dir/version-2
snapdir /zonestorage/hudson_solaris/home/hudson/hudson-slave/workspace/ZooKeeper_branch34_solaris/build/test/tmp/test2614513272421559936.junit.dir/version-2
    [junit] 2017-02-11 13:30:42,615 [myid:] - INFO  [main:NIOServerCnxnFactory@89] - binding
to port 0.0.0.0/0.0.0.0:11221
    [junit] 2017-02-11 13:30:42,761 [myid:] - INFO  [main:FileSnap@83] - Reading snapshot
/zonestorage/hudson_solaris/home/hudson/hudson-slave/workspace/ZooKeeper_branch34_solaris/build/test/tmp/test2614513272421559936.junit.dir/version-2/snapshot.12d
    [junit] 2017-02-11 13:30:42,782 [myid:] - ERROR [main:ZooKeeperServer@472] - ZKShutdownHandler
is not registered, so ZooKeeper server won't take any action on ERROR or SHUTDOWN server state
changes
    [junit] 2017-02-11 13:30:42,783 [myid:] - INFO  [main:ZooKeeper@438] - Initiating client
connection, connectString=127.0.0.1:11221 sessionTimeout=30000 watcher=org.apache.zookeeper.test.ClientBase$CountdownWatcher@113981b
    [junit] 2017-02-11 13:30:42,784 [myid:] - INFO  [main-SendThread(127.0.0.1:11221):ClientCnxn$SendThread@1032]
- Opening socket connection to server 127.0.0.1/127.0.0.1:11221. Will not attempt to authenticate
using SASL (java.lang.SecurityException: Unable to locate a login configuration)
    [junit] 2017-02-11 13:30:42,784 [myid:] - INFO  [main-SendThread(127.0.0.1:11221):ClientCnxn$SendThread@876]
- Socket connection established to 127.0.0.1/127.0.0.1:11221, initiating session
    [junit] 2017-02-11 13:30:42,784 [myid:] - INFO  [NIOServerCxn.Factory:0.0.0.0/0.0.0.0:11221:NIOServerCnxnFactory@192]
- Accepted socket connection from /127.0.0.1:34678
    [junit] 2017-02-11 13:30:42,784 [myid:] - INFO  [NIOServerCxn.Factory:0.0.0.0/0.0.0.0:11221:ZooKeeperServer@928]
- Client attempting to establish new session at /127.0.0.1:34678
    [junit] 2017-02-11 13:30:42,785 [myid:] - INFO  [SyncThread:0:FileTxnLog@203] - Creating
new log file: log.193
    [junit] 2017-02-11 13:30:42,786 [myid:] - INFO  [SyncThread:0:ZooKeeperServer@673] - Established
session 0x15a2d5e5ade0000 with negotiated timeout 30000 for client /127.0.0.1:34678
    [junit] 2017-02-11 13:30:42,786 [myid:] - INFO  [main-SendThread(127.0.0.1:11221):ClientCnxn$SendThread@1299]
- Session establishment complete on server 127.0.0.1/127.0.0.1:11221, sessionid = 0x15a2d5e5ade0000,
negotiated timeout = 30000
    [junit] 2017-02-11 13:30:42,951 [myid:] - WARN  [NIOServerCxn.Factory:0.0.0.0/0.0.0.0:11221:NIOServerCnxnFactory@215]
- Ignoring exception
    [junit] java.nio.channels.ClosedChannelException
    [junit] 	at sun.nio.ch.ServerSocketChannelImpl.accept(ServerSocketChannelImpl.java:137)
    [junit] 	at org.apache.zookeeper.server.NIOServerCnxnFactory.run(NIOServerCnxnFactory.java:183)
    [junit] 	at java.lang.Thread.run(Thread.java:662)
    [junit] 2017-02-11 13:30:42,952 [myid:] - INFO  [main:NIOServerCnxn@1019] - Closed socket
connection for client /127.0.0.1:34678 which had sessionid 0x15a2d5e5ade0000
    [junit] 2017-02-11 13:30:42,952 [myid:] - INFO  [main-SendThread(127.0.0.1:11221):ClientCnxn$SendThread@1158]
- Unable to read additional data from server sessionid 0x15a2d5e5ade0000, likely server has
closed socket, closing socket connection and attempting reconnect
    [junit] 2017-02-11 13:30:42,953 [myid:] - INFO  [main:ZooKeeperServer@497] - shutting
down
    [junit] 2017-02-11 13:30:42,953 [myid:] - ERROR [main:ZooKeeperServer@472] - ZKShutdownHandler
is not registered, so ZooKeeper server won't take any action on ERROR or SHUTDOWN server state
changes
    [junit] 2017-02-11 13:30:42,953 [myid:] - INFO  [main:SessionTrackerImpl@225] - Shutting
down
    [junit] 2017-02-11 13:30:42,953 [myid:] - INFO  [main:PrepRequestProcessor@764] - Shutting
down
    [junit] 2017-02-11 13:30:42,953 [myid:] - INFO  [main:SyncRequestProcessor@208] - Shutting
down
    [junit] 2017-02-11 13:30:42,953 [myid:] - INFO  [ProcessThread(sid:0 cport:11221)::PrepRequestProcessor@143]
- PrepRequestProcessor exited loop!
    [junit] 2017-02-11 13:30:42,953 [myid:] - INFO  [SyncThread:0:SyncRequestProcessor@186]
- SyncRequestProcessor exited!
    [junit] 2017-02-11 13:30:42,953 [myid:] - INFO  [main:FinalRequestProcessor@402] - shutdown
of request processor complete
    [junit] 2017-02-11 13:30:42,954 [myid:] - INFO  [main:JUnit4ZKTestRunner$LoggedInvokeMethod@58]
- Memory used 12539
    [junit] 2017-02-11 13:30:42,954 [myid:] - INFO  [main:JUnit4ZKTestRunner$LoggedInvokeMethod@63]
- Number of threads 8
    [junit] 2017-02-11 13:30:42,954 [myid:] - INFO  [main:JUnit4ZKTestRunner$LoggedInvokeMethod@78]
- FINISHED TEST METHOD testPurgeDoesNotDeleteOverlappingLogFile
    [junit] 2017-02-11 13:30:42,982 [myid:] - INFO  [main:ZKTestCase$1@65] - SUCCEEDED testPurgeDoesNotDeleteOverlappingLogFile
    [junit] 2017-02-11 13:30:42,982 [myid:] - INFO  [main:ZKTestCase$1@60] - FINISHED testPurgeDoesNotDeleteOverlappingLogFile
    [junit] Tests run: 10, Failures: 0, Errors: 0, Time elapsed: 25.443 sec
    [junit] Running org.apache.zookeeper.server.ReferenceCountedACLCacheTest
    [junit] SLF4J: Class path contains multiple SLF4J bindings.
    [junit] SLF4J: Found binding in [jar:file:/zonestorage/hudson_solaris/home/hudson/hudson-slave/workspace/ZooKeeper_branch34_solaris/build/test/lib/slf4j-log4j12-1.7.14.jar!/org/slf4j/impl/StaticLoggerBinder.class]
    [junit] SLF4J: Found binding in [jar:file:/zonestorage/hudson_solaris/home/hudson/hudson-slave/workspace/ZooKeeper_branch34_solaris/build/lib/slf4j-log4j12-1.6.1.jar!/org/slf4j/impl/StaticLoggerBinder.class]
    [junit] SLF4J: See http://www.slf4j.org/codes.html#multiple_bindings for an explanation.
    [junit] SLF4J: Actual binding is of type [org.slf4j.impl.Log4jLoggerFactory]
    [junit] 2017-02-11 13:30:48,649 [myid:] - INFO  [main:ReferenceCountedACLCache@155] -
Ignoring acl 1 as it does not exist in the cache
    [junit] Tests run: 10, Failures: 0, Errors: 0, Time elapsed: 0.825 sec
    [junit] Running org.apache.zookeeper.server.SerializationPerfTest
    [junit] Tests run: 1, Failures: 0, Errors: 1, Time elapsed: 0 sec

BUILD FAILED
/zonestorage/hudson_solaris/home/hudson/hudson-slave/workspace/ZooKeeper_branch34_solaris/build.xml:1297:
Process fork failed.

Total time: 5 minutes 22 seconds
Build step 'Invoke Ant' marked build as failure
[locks-and-latches] Releasing all the locks
[locks-and-latches] All the locks released
Recording test results
Email was triggered for: Failure - Any
Sending email for trigger: Failure - Any



###################################################################################
############################## FAILED TESTS (if any) ##############################
1 tests failed.
FAILED:  org.apache.zookeeper.server.SerializationPerfTest.unknown

Error Message:
Forked Java VM exited abnormally. Please note the time in the report does not reflect the
time until the VM exit.

Stack Trace:
junit.framework.AssertionFailedError: Forked Java VM exited abnormally. Please note the time
in the report does not reflect the time until the VM exit.



Mime
  • Unnamed multipart/mixed (inline, None, 0 bytes)
View raw message