zookeeper-dev mailing list archives

Site index · List index
Message view « Date » · « Thread »
Top « Date » · « Thread »
From Apache Jenkins Server <jenk...@builds.apache.org>
Subject ZooKeeper-trunk-jdk8 - Build # 925 - Still Failing
Date Sat, 04 Feb 2017 11:58:54 GMT
See https://builds.apache.org/job/ZooKeeper-trunk-jdk8/925/

###################################################################################
########################## LAST 60 LINES OF THE CONSOLE ###########################
[...truncated 432956 lines...]
    [junit] 	at org.apache.zookeeper.ClientCnxnSocketNIO.doTransport(ClientCnxnSocketNIO.java:357)
    [junit] 	at org.apache.zookeeper.ClientCnxn$SendThread.run(ClientCnxn.java:1214)
    [junit] 2017-02-04 11:58:16,276 [myid:127.0.0.1:11345] - INFO  [main-SendThread(127.0.0.1:11345):ClientCnxn$SendThread@1113]
- Opening socket connection to server 127.0.0.1/127.0.0.1:11345. Will not attempt to authenticate
using SASL (unknown error)
    [junit] 2017-02-04 11:58:16,276 [myid:127.0.0.1:11345] - WARN  [main-SendThread(127.0.0.1:11345):ClientCnxn$SendThread@1235]
- Session 0x102342c24550000 for server 127.0.0.1/127.0.0.1:11345, unexpected error, closing
socket connection and attempting reconnect
    [junit] java.net.ConnectException: Connection refused
    [junit] 	at sun.nio.ch.SocketChannelImpl.checkConnect(Native Method)
    [junit] 	at sun.nio.ch.SocketChannelImpl.finishConnect(SocketChannelImpl.java:717)
    [junit] 	at org.apache.zookeeper.ClientCnxnSocketNIO.doTransport(ClientCnxnSocketNIO.java:357)
    [junit] 	at org.apache.zookeeper.ClientCnxn$SendThread.run(ClientCnxn.java:1214)
    [junit] 2017-02-04 11:58:16,322 [myid:127.0.0.1:11351] - INFO  [main-SendThread(127.0.0.1:11351):ClientCnxn$SendThread@1113]
- Opening socket connection to server 127.0.0.1/127.0.0.1:11351. Will not attempt to authenticate
using SASL (unknown error)
    [junit] 2017-02-04 11:58:16,323 [myid:127.0.0.1:11351] - WARN  [main-SendThread(127.0.0.1:11351):ClientCnxn$SendThread@1235]
- Session 0x302342c24720000 for server 127.0.0.1/127.0.0.1:11351, unexpected error, closing
socket connection and attempting reconnect
    [junit] java.net.ConnectException: Connection refused
    [junit] 	at sun.nio.ch.SocketChannelImpl.checkConnect(Native Method)
    [junit] 	at sun.nio.ch.SocketChannelImpl.finishConnect(SocketChannelImpl.java:717)
    [junit] 	at org.apache.zookeeper.ClientCnxnSocketNIO.doTransport(ClientCnxnSocketNIO.java:357)
    [junit] 	at org.apache.zookeeper.ClientCnxn$SendThread.run(ClientCnxn.java:1214)
    [junit] 2017-02-04 11:58:16,391 [myid:] - INFO  [ProcessThread(sid:0 cport:11468)::PrepRequestProcessor@618]
- Processed session termination for sessionid: 0x102342fb2c00000
    [junit] 2017-02-04 11:58:16,400 [myid:] - INFO  [main:ZooKeeper@1324] - Session: 0x102342fb2c00000
closed
    [junit] 2017-02-04 11:58:16,400 [myid:] - INFO  [main-EventThread:ClientCnxn$EventThread@513]
- EventThread shut down for session: 0x102342fb2c00000
    [junit] 2017-02-04 11:58:16,400 [myid:] - INFO  [SyncThread:0:MBeanRegistry@128] - Unregister
MBean [org.apache.ZooKeeperService:name0=StandaloneServer_port11468,name1=Connections,name2=127.0.0.1,name3=0x102342fb2c00000]
    [junit] 2017-02-04 11:58:16,400 [myid:] - INFO  [main:JUnit4ZKTestRunner$LoggedInvokeMethod@82]
- Memory used 212226
    [junit] 2017-02-04 11:58:16,401 [myid:] - INFO  [main:JUnit4ZKTestRunner$LoggedInvokeMethod@87]
- Number of threads 2427
    [junit] 2017-02-04 11:58:16,401 [myid:] - INFO  [main:JUnit4ZKTestRunner$LoggedInvokeMethod@102]
- FINISHED TEST METHOD testWatcherAutoResetWithLocal
    [junit] 2017-02-04 11:58:16,401 [myid:] - INFO  [main:ClientBase@558] - tearDown starting
    [junit] 2017-02-04 11:58:16,401 [myid:] - INFO  [main:ClientBase@528] - STOPPING server
    [junit] 2017-02-04 11:58:16,401 [myid:] - INFO  [main:NettyServerCnxnFactory@464] - shutdown
called 0.0.0.0/0.0.0.0:11468
    [junit] 2017-02-04 11:58:16,408 [myid:] - INFO  [main:ZooKeeperServer@534] - shutting
down
    [junit] 2017-02-04 11:58:16,408 [myid:] - ERROR [main:ZooKeeperServer@506] - ZKShutdownHandler
is not registered, so ZooKeeper server won't take any action on ERROR or SHUTDOWN server state
changes
    [junit] 2017-02-04 11:58:16,408 [myid:] - INFO  [main:SessionTrackerImpl@232] - Shutting
down
    [junit] 2017-02-04 11:58:16,408 [myid:] - INFO  [main:PrepRequestProcessor@1009] - Shutting
down
    [junit] 2017-02-04 11:58:16,409 [myid:] - INFO  [main:SyncRequestProcessor@191] - Shutting
down
    [junit] 2017-02-04 11:58:16,409 [myid:] - INFO  [SyncThread:0:SyncRequestProcessor@169]
- SyncRequestProcessor exited!
    [junit] 2017-02-04 11:58:16,409 [myid:] - INFO  [ProcessThread(sid:0 cport:11468)::PrepRequestProcessor@157]
- PrepRequestProcessor exited loop!
    [junit] 2017-02-04 11:58:16,409 [myid:] - INFO  [main:FinalRequestProcessor@481] - shutdown
of request processor complete
    [junit] 2017-02-04 11:58:16,458 [myid:] - INFO  [main:MBeanRegistry@128] - Unregister
MBean [org.apache.ZooKeeperService:name0=StandaloneServer_port11468,name1=InMemoryDataTree]
    [junit] 2017-02-04 11:58:16,458 [myid:] - INFO  [main:MBeanRegistry@128] - Unregister
MBean [org.apache.ZooKeeperService:name0=StandaloneServer_port11468]
    [junit] 2017-02-04 11:58:16,498 [myid:] - INFO  [main:FourLetterWordMain@85] - connecting
to 127.0.0.1 11468
    [junit] 2017-02-04 11:58:16,499 [myid:] - INFO  [main:JMXEnv@146] - ensureOnly:[]
    [junit] 2017-02-04 11:58:16,514 [myid:] - INFO  [main:ClientBase@583] - fdcount after
test is: 7130 at start it was 7134
    [junit] 2017-02-04 11:58:16,515 [myid:] - INFO  [main:ZKTestCase$1@65] - SUCCEEDED testWatcherAutoResetWithLocal
    [junit] 2017-02-04 11:58:16,515 [myid:] - INFO  [main:ZKTestCase$1@60] - FINISHED testWatcherAutoResetWithLocal
    [junit] Tests run: 103, Failures: 0, Errors: 0, Skipped: 0, Time elapsed: 538.066 sec,
Thread: 1, Class: org.apache.zookeeper.test.NioNettySuiteTest
    [junit] 2017-02-04 11:58:16,774 [myid:127.0.0.1:11348] - INFO  [main-SendThread(127.0.0.1:11348):ClientCnxn$SendThread@1113]
- Opening socket connection to server 127.0.0.1/127.0.0.1:11348. Will not attempt to authenticate
using SASL (unknown error)
    [junit] 2017-02-04 11:58:16,775 [myid:127.0.0.1:11348] - WARN  [main-SendThread(127.0.0.1:11348):ClientCnxn$SendThread@1235]
- Session 0x202342c28290000 for server 127.0.0.1/127.0.0.1:11348, unexpected error, closing
socket connection and attempting reconnect
    [junit] java.net.ConnectException: Connection refused
    [junit] 	at sun.nio.ch.SocketChannelImpl.checkConnect(Native Method)
    [junit] 	at sun.nio.ch.SocketChannelImpl.finishConnect(SocketChannelImpl.java:717)
    [junit] 	at org.apache.zookeeper.ClientCnxnSocketNIO.doTransport(ClientCnxnSocketNIO.java:357)
    [junit] 	at org.apache.zookeeper.ClientCnxn$SendThread.run(ClientCnxn.java:1214)

BUILD FAILED
/home/jenkins/jenkins-slave/workspace/ZooKeeper-trunk-jdk8/build.xml:1211: Tests failed!

Total time: 13 minutes 51 seconds
Build step 'Invoke Ant' marked build as failure
[WARNINGS] Skipping publisher since build result is FAILURE
Recording test results
Email was triggered for: Failure - Any
Sending email for trigger: Failure - Any



###################################################################################
############################## FAILED TESTS (if any) ##############################
4 tests failed.
FAILED:  org.apache.zookeeper.server.quorum.ReconfigFailureCasesTest.testLeaderTimesoutOnNewQuorum

Error Message:
Should have been ConnectionLossException!

Stack Trace:
junit.framework.AssertionFailedError: Should have been ConnectionLossException!
	at org.apache.zookeeper.server.quorum.ReconfigFailureCasesTest.testLeaderTimesoutOnNewQuorum(ReconfigFailureCasesTest.java:190)
	at org.apache.zookeeper.JUnit4ZKTestRunner$LoggedInvokeMethod.evaluate(JUnit4ZKTestRunner.java:79)


FAILED:  org.apache.zookeeper.test.FourLetterWordsQuorumTest.testFourLetterWords

Error Message:
Exception while executing four letter word: conf

Stack Trace:
java.io.IOException: Exception while executing four letter word: conf
	at org.apache.zookeeper.client.FourLetterWordMain.send4LetterWord(FourLetterWordMain.java:124)
	at org.apache.zookeeper.client.FourLetterWordMain.send4LetterWord(FourLetterWordMain.java:54)
	at org.apache.zookeeper.test.FourLetterWordsQuorumTest.verify(FourLetterWordsQuorumTest.java:109)
	at org.apache.zookeeper.test.FourLetterWordsQuorumTest.testFourLetterWords(FourLetterWordsQuorumTest.java:44)
	at org.apache.zookeeper.JUnit4ZKTestRunner$LoggedInvokeMethod.evaluate(JUnit4ZKTestRunner.java:79)
Caused by: java.net.SocketTimeoutException: Read timed out
	at java.net.SocketInputStream.socketRead0(Native Method)
	at java.net.SocketInputStream.socketRead(SocketInputStream.java:116)
	at java.net.SocketInputStream.read(SocketInputStream.java:170)
	at java.net.SocketInputStream.read(SocketInputStream.java:141)
	at sun.nio.cs.StreamDecoder.readBytes(StreamDecoder.java:284)
	at sun.nio.cs.StreamDecoder.implRead(StreamDecoder.java:326)
	at sun.nio.cs.StreamDecoder.read(StreamDecoder.java:178)
	at java.io.InputStreamReader.read(InputStreamReader.java:184)
	at java.io.BufferedReader.fill(BufferedReader.java:161)
	at java.io.BufferedReader.readLine(BufferedReader.java:324)
	at java.io.BufferedReader.readLine(BufferedReader.java:389)
	at org.apache.zookeeper.client.FourLetterWordMain.send4LetterWord(FourLetterWordMain.java:119)


FAILED:  org.apache.zookeeper.test.FourLetterWordsTest.testValidateSocketTimeout

Error Message:
Exception while executing four letter word: isro

Stack Trace:
java.io.IOException: Exception while executing four letter word: isro
	at org.apache.zookeeper.client.FourLetterWordMain.send4LetterWord(FourLetterWordMain.java:124)
	at org.apache.zookeeper.test.FourLetterWordsTest.sendRequest(FourLetterWordsTest.java:124)
	at org.apache.zookeeper.test.FourLetterWordsTest.testValidateSocketTimeout(FourLetterWordsTest.java:203)
	at org.apache.zookeeper.JUnit4ZKTestRunner$LoggedInvokeMethod.evaluate(JUnit4ZKTestRunner.java:79)
	at java.util.concurrent.FutureTask.run(FutureTask.java:266)
	at java.lang.Thread.run(Thread.java:745)
Caused by: java.net.SocketTimeoutException: Read timed out
	at java.net.SocketInputStream.socketRead0(Native Method)
	at java.net.SocketInputStream.socketRead(SocketInputStream.java:116)
	at java.net.SocketInputStream.read(SocketInputStream.java:170)
	at java.net.SocketInputStream.read(SocketInputStream.java:141)
	at sun.nio.cs.StreamDecoder.readBytes(StreamDecoder.java:284)
	at sun.nio.cs.StreamDecoder.implRead(StreamDecoder.java:326)
	at sun.nio.cs.StreamDecoder.read(StreamDecoder.java:178)
	at java.io.InputStreamReader.read(InputStreamReader.java:184)
	at java.io.BufferedReader.fill(BufferedReader.java:161)
	at java.io.BufferedReader.readLine(BufferedReader.java:324)
	at java.io.BufferedReader.readLine(BufferedReader.java:389)
	at org.apache.zookeeper.client.FourLetterWordMain.send4LetterWord(FourLetterWordMain.java:119)


FAILED:  org.apache.zookeeper.test.SSLTest.testSecureQuorumServer

Error Message:
waiting for server 0 being up

Stack Trace:
junit.framework.AssertionFailedError: waiting for server 0 being up
	at org.apache.zookeeper.test.SSLTest.testSecureQuorumServer(SSLTest.java:96)
	at org.apache.zookeeper.JUnit4ZKTestRunner$LoggedInvokeMethod.evaluate(JUnit4ZKTestRunner.java:79)



Mime
  • Unnamed multipart/mixed (inline, None, 0 bytes)
View raw message