zookeeper-dev mailing list archives

Site index · List index
Message view « Date » · « Thread »
Top « Date » · « Thread »
From Apache Jenkins Server <jenk...@builds.apache.org>
Subject ZooKeeper_branch35_openjdk7 - Build # 422 - Failure
Date Fri, 17 Feb 2017 10:08:47 GMT
See https://builds.apache.org/job/ZooKeeper_branch35_openjdk7/422/

###################################################################################
########################## LAST 60 LINES OF THE CONSOLE ###########################
[...truncated 471383 lines...]
    [junit] 2017-02-17 10:08:26,856 [myid:] - INFO  [ProcessThread(sid:0 cport:22240)::PrepRequestProcessor@655]
- Processed session termination for sessionid: 0x1020bb60f2a0000
    [junit] 2017-02-17 10:08:26,860 [myid:] - INFO  [New I/O worker #1829:MBeanRegistry@128]
- Unregister MBean [org.apache.ZooKeeperService:name0=StandaloneServer_port22240,name1=Connections,name2=127.0.0.1,name3=0x1020bb60f2a0000]
    [junit] 2017-02-17 10:08:26,860 [myid:] - INFO  [main-EventThread:ClientCnxn$EventThread@513]
- EventThread shut down for session: 0x1020bb60f2a0000
    [junit] 2017-02-17 10:08:26,861 [myid:] - INFO  [main:ZooKeeper@1324] - Session: 0x1020bb60f2a0000
closed
    [junit] 2017-02-17 10:08:26,861 [myid:] - INFO  [main:JUnit4ZKTestRunner$LoggedInvokeMethod@82]
- Memory used 83776
    [junit] 2017-02-17 10:08:26,861 [myid:] - INFO  [main:JUnit4ZKTestRunner$LoggedInvokeMethod@87]
- Number of threads 467
    [junit] 2017-02-17 10:08:26,861 [myid:] - INFO  [main:JUnit4ZKTestRunner$LoggedInvokeMethod@102]
- FINISHED TEST METHOD testWatcherAutoResetWithLocal
    [junit] 2017-02-17 10:08:26,861 [myid:] - INFO  [main:ClientBase@543] - tearDown starting
    [junit] 2017-02-17 10:08:26,862 [myid:] - INFO  [main:ClientBase@513] - STOPPING server
    [junit] 2017-02-17 10:08:26,862 [myid:] - INFO  [main:NettyServerCnxnFactory@464] - shutdown
called 0.0.0.0/0.0.0.0:22240
    [junit] 2017-02-17 10:08:26,867 [myid:] - INFO  [main:ZooKeeperServer@541] - shutting
down
    [junit] 2017-02-17 10:08:26,868 [myid:] - ERROR [main:ZooKeeperServer@505] - ZKShutdownHandler
is not registered, so ZooKeeper server won't take any action on ERROR or SHUTDOWN server state
changes
    [junit] 2017-02-17 10:08:26,868 [myid:] - INFO  [main:SessionTrackerImpl@232] - Shutting
down
    [junit] 2017-02-17 10:08:26,868 [myid:] - INFO  [main:PrepRequestProcessor@973] - Shutting
down
    [junit] 2017-02-17 10:08:26,868 [myid:] - INFO  [ProcessThread(sid:0 cport:22240)::PrepRequestProcessor@154]
- PrepRequestProcessor exited loop!
    [junit] 2017-02-17 10:08:26,868 [myid:] - INFO  [main:SyncRequestProcessor@191] - Shutting
down
    [junit] 2017-02-17 10:08:26,869 [myid:] - INFO  [SyncThread:0:SyncRequestProcessor@169]
- SyncRequestProcessor exited!
    [junit] 2017-02-17 10:08:26,869 [myid:] - INFO  [main:FinalRequestProcessor@479] - shutdown
of request processor complete
    [junit] 2017-02-17 10:08:26,869 [myid:] - INFO  [main:MBeanRegistry@128] - Unregister
MBean [org.apache.ZooKeeperService:name0=StandaloneServer_port22240,name1=InMemoryDataTree]
    [junit] 2017-02-17 10:08:26,870 [myid:] - INFO  [main:MBeanRegistry@128] - Unregister
MBean [org.apache.ZooKeeperService:name0=StandaloneServer_port22240]
    [junit] 2017-02-17 10:08:26,870 [myid:] - INFO  [main:FourLetterWordMain@85] - connecting
to 127.0.0.1 22240
    [junit] 2017-02-17 10:08:26,871 [myid:] - INFO  [main:JMXEnv@146] - ensureOnly:[]
    [junit] 2017-02-17 10:08:26,878 [myid:] - INFO  [main:ClientBase@568] - fdcount after
test is: 1377 at start it was 1377
    [junit] 2017-02-17 10:08:26,878 [myid:] - INFO  [main:ZKTestCase$1@65] - SUCCEEDED testWatcherAutoResetWithLocal
    [junit] 2017-02-17 10:08:26,878 [myid:] - INFO  [main:ZKTestCase$1@60] - FINISHED testWatcherAutoResetWithLocal
    [junit] Tests run: 103, Failures: 0, Errors: 0, Skipped: 0, Time elapsed: 460.236 sec,
Thread: 5, Class: org.apache.zookeeper.test.NioNettySuiteTest
    [junit] 2017-02-17 10:08:27,117 [myid:127.0.0.1:22117] - INFO  [main-SendThread(127.0.0.1:22117):ClientCnxn$SendThread@1113]
- Opening socket connection to server 127.0.0.1/127.0.0.1:22117. Will not attempt to authenticate
using SASL (unknown error)
    [junit] 2017-02-17 10:08:27,118 [myid:127.0.0.1:22117] - WARN  [main-SendThread(127.0.0.1:22117):ClientCnxn$SendThread@1235]
- Session 0x1020bb308ce0000 for server 127.0.0.1/127.0.0.1:22117, unexpected error, closing
socket connection and attempting reconnect
    [junit] java.net.ConnectException: Connection refused
    [junit] 	at sun.nio.ch.SocketChannelImpl.checkConnect(Native Method)
    [junit] 	at sun.nio.ch.SocketChannelImpl.finishConnect(SocketChannelImpl.java:739)
    [junit] 	at org.apache.zookeeper.ClientCnxnSocketNIO.doTransport(ClientCnxnSocketNIO.java:357)
    [junit] 	at org.apache.zookeeper.ClientCnxn$SendThread.run(ClientCnxn.java:1214)
    [junit] 2017-02-17 10:08:27,156 [myid:127.0.0.1:22120] - INFO  [main-SendThread(127.0.0.1:22120):ClientCnxn$SendThread@1113]
- Opening socket connection to server 127.0.0.1/127.0.0.1:22120. Will not attempt to authenticate
using SASL (unknown error)
    [junit] 2017-02-17 10:08:27,157 [myid:127.0.0.1:22120] - WARN  [main-SendThread(127.0.0.1:22120):ClientCnxn$SendThread@1235]
- Session 0x2020bb304f30000 for server 127.0.0.1/127.0.0.1:22120, unexpected error, closing
socket connection and attempting reconnect
    [junit] java.net.ConnectException: Connection refused
    [junit] 	at sun.nio.ch.SocketChannelImpl.checkConnect(Native Method)
    [junit] 	at sun.nio.ch.SocketChannelImpl.finishConnect(SocketChannelImpl.java:739)
    [junit] 	at org.apache.zookeeper.ClientCnxnSocketNIO.doTransport(ClientCnxnSocketNIO.java:357)
    [junit] 	at org.apache.zookeeper.ClientCnxn$SendThread.run(ClientCnxn.java:1214)
    [junit] 2017-02-17 10:08:27,305 [myid:127.0.0.1:21994] - INFO  [main-SendThread(127.0.0.1:21994):ClientCnxn$SendThread@1113]
- Opening socket connection to server 127.0.0.1/127.0.0.1:21994. Will not attempt to authenticate
using SASL (unknown error)
    [junit] 2017-02-17 10:08:27,306 [myid:127.0.0.1:21994] - WARN  [main-SendThread(127.0.0.1:21994):ClientCnxn$SendThread@1235]
- Session 0x1020baf219a0000 for server 127.0.0.1/127.0.0.1:21994, unexpected error, closing
socket connection and attempting reconnect
    [junit] java.net.ConnectException: Connection refused
    [junit] 	at sun.nio.ch.SocketChannelImpl.checkConnect(Native Method)
    [junit] 	at sun.nio.ch.SocketChannelImpl.finishConnect(SocketChannelImpl.java:739)
    [junit] 	at org.apache.zookeeper.ClientCnxnSocketNIO.doTransport(ClientCnxnSocketNIO.java:357)
    [junit] 	at org.apache.zookeeper.ClientCnxn$SendThread.run(ClientCnxn.java:1214)

fail.build.on.test.failure:

BUILD FAILED
/home/jenkins/jenkins-slave/workspace/ZooKeeper_branch35_openjdk7/build.xml:1211: The following
error occurred while executing this line:
/home/jenkins/jenkins-slave/workspace/ZooKeeper_branch35_openjdk7/build.xml:1215: Tests failed!

Total time: 11 minutes 40 seconds
Build step 'Invoke Ant' marked build as failure
Recording test results
Email was triggered for: Failure - Any
Sending email for trigger: Failure - Any



###################################################################################
############################## FAILED TESTS (if any) ##############################
7 tests failed.
FAILED:  org.apache.zookeeper.test.WatcherTest.testWatchAutoResetWithPending

Error Message:
Unexpected bean exists! expected:<0> but was:<1>

Stack Trace:
junit.framework.AssertionFailedError: Unexpected bean exists! expected:<0> but was:<1>
	at org.apache.zookeeper.test.ClientBase.verifyUnexpectedBeans(ClientBase.java:498)
	at org.apache.zookeeper.test.ClientBase.startServer(ClientBase.java:477)
	at org.apache.zookeeper.test.ClientBase.setUp(ClientBase.java:460)
	at org.apache.zookeeper.test.WatcherTest.setUp(WatcherTest.java:76)


FAILED:  org.apache.zookeeper.test.WatcherTest.testWatcherCorrectness

Error Message:
Unexpected bean exists! expected:<0> but was:<1>

Stack Trace:
junit.framework.AssertionFailedError: Unexpected bean exists! expected:<0> but was:<1>
	at org.apache.zookeeper.test.ClientBase.verifyUnexpectedBeans(ClientBase.java:498)
	at org.apache.zookeeper.test.ClientBase.startServer(ClientBase.java:477)
	at org.apache.zookeeper.test.ClientBase.setUp(ClientBase.java:460)
	at org.apache.zookeeper.test.WatcherTest.setUp(WatcherTest.java:76)


FAILED:  org.apache.zookeeper.test.WatcherTest.testWatcherAutoResetDisabledWithLocal

Error Message:
Unexpected bean exists! expected:<0> but was:<1>

Stack Trace:
junit.framework.AssertionFailedError: Unexpected bean exists! expected:<0> but was:<1>
	at org.apache.zookeeper.test.ClientBase.verifyUnexpectedBeans(ClientBase.java:498)
	at org.apache.zookeeper.test.ClientBase.startServer(ClientBase.java:477)
	at org.apache.zookeeper.test.ClientBase.setUp(ClientBase.java:460)
	at org.apache.zookeeper.test.WatcherTest.setUp(WatcherTest.java:76)


FAILED:  org.apache.zookeeper.test.WatcherTest.testWatcherAutoResetWithGlobal

Error Message:
Unexpected bean exists! expected:<0> but was:<1>

Stack Trace:
junit.framework.AssertionFailedError: Unexpected bean exists! expected:<0> but was:<1>
	at org.apache.zookeeper.test.ClientBase.verifyUnexpectedBeans(ClientBase.java:498)
	at org.apache.zookeeper.test.ClientBase.startServer(ClientBase.java:477)
	at org.apache.zookeeper.test.ClientBase.setUp(ClientBase.java:460)
	at org.apache.zookeeper.test.WatcherTest.setUp(WatcherTest.java:76)


FAILED:  org.apache.zookeeper.test.WatcherTest.testWatcherCount

Error Message:
Unexpected bean exists! expected:<0> but was:<1>

Stack Trace:
junit.framework.AssertionFailedError: Unexpected bean exists! expected:<0> but was:<1>
	at org.apache.zookeeper.test.ClientBase.verifyUnexpectedBeans(ClientBase.java:498)
	at org.apache.zookeeper.test.ClientBase.startServer(ClientBase.java:477)
	at org.apache.zookeeper.test.ClientBase.setUp(ClientBase.java:460)
	at org.apache.zookeeper.test.WatcherTest.setUp(WatcherTest.java:76)


FAILED:  org.apache.zookeeper.test.WatcherTest.testWatcherAutoResetDisabledWithGlobal

Error Message:
Unexpected bean exists! expected:<0> but was:<1>

Stack Trace:
junit.framework.AssertionFailedError: Unexpected bean exists! expected:<0> but was:<1>
	at org.apache.zookeeper.test.ClientBase.verifyUnexpectedBeans(ClientBase.java:498)
	at org.apache.zookeeper.test.ClientBase.startServer(ClientBase.java:477)
	at org.apache.zookeeper.test.ClientBase.setUp(ClientBase.java:460)
	at org.apache.zookeeper.test.WatcherTest.setUp(WatcherTest.java:76)


FAILED:  org.apache.zookeeper.test.WatcherTest.testWatcherAutoResetWithLocal

Error Message:
Unexpected bean exists! expected:<0> but was:<1>

Stack Trace:
junit.framework.AssertionFailedError: Unexpected bean exists! expected:<0> but was:<1>
	at org.apache.zookeeper.test.ClientBase.verifyUnexpectedBeans(ClientBase.java:498)
	at org.apache.zookeeper.test.ClientBase.startServer(ClientBase.java:477)
	at org.apache.zookeeper.test.ClientBase.setUp(ClientBase.java:460)
	at org.apache.zookeeper.test.WatcherTest.setUp(WatcherTest.java:76)



Mime
  • Unnamed multipart/mixed (inline, None, 0 bytes)
View raw message