zookeeper-dev mailing list archives

Site index · List index
Message view « Date » · « Thread »
Top « Date » · « Thread »
From Apache Jenkins Server <jenk...@builds.apache.org>
Subject ZooKeeper_branch35_solaris - Build # 430 - Failure
Date Fri, 10 Feb 2017 16:36:34 GMT
See https://builds.apache.org/job/ZooKeeper_branch35_solaris/430/

###################################################################################
########################## LAST 60 LINES OF THE CONSOLE ###########################
[...truncated 34713 lines...]
    [junit] 2017-02-10 16:37:00,517 [myid:] - INFO  [main:ZKTestCase$1@55] - STARTING syncTest
    [junit] 2017-02-10 16:37:00,517 [myid:] - INFO  [main:JUnit4ZKTestRunner$LoggedInvokeMethod@77]
- RUNNING TEST METHOD syncTest
    [junit] 2017-02-10 16:37:09,676 [myid:] - INFO  [main:Environment@109] - Server environment:zookeeper.version=3.5.3-alpha-SNAPSHOT--1,
built on 02/10/2017 16:11 GMT
    [junit] 2017-02-10 16:37:09,676 [myid:] - INFO  [main:Environment@109] - Server environment:host.name=hudson-solaris
    [junit] 2017-02-10 16:37:09,677 [myid:] - INFO  [main:Environment@109] - Server environment:java.version=1.7.0_79
    [junit] 2017-02-10 16:37:09,677 [myid:] - INFO  [main:Environment@109] - Server environment:java.vendor=Oracle
Corporation
    [junit] 2017-02-10 16:37:09,677 [myid:] - INFO  [main:Environment@109] - Server environment:java.home=/zonestorage/hudson_solaris/home/hudson/tools/java/jdk1.7.0_79/jre
    [junit] 2017-02-10 16:37:09,677 [myid:] - INFO  [main:Environment@109] - Server environment:java.class.path=/zonestorage/hudson_solaris/home/hudson/hudson-slave/workspace/ZooKeeper_branch35_solaris/build/test/classes:/zonestorage/hudson_solaris/home/hudson/hudson-slave/workspace/ZooKeeper_branch35_solaris/build/test/lib/antlr-2.7.7.jar:/zonestorage/hudson_solaris/home/hudson/hudson-slave/workspace/ZooKeeper_branch35_solaris/build/test/lib/antlr4-runtime-4.5.1-1.jar:/zonestorage/hudson_solaris/home/hudson/hudson-slave/workspace/ZooKeeper_branch35_solaris/build/test/lib/checkstyle-6.13.jar:/zonestorage/hudson_solaris/home/hudson/hudson-slave/workspace/ZooKeeper_branch35_solaris/build/test/lib/commons-beanutils-1.9.2.jar:/zonestorage/hudson_solaris/home/hudson/hudson-slave/workspace/ZooKeeper_branch35_solaris/build/test/lib/commons-cli-1.3.1.jar:/zonestorage/hudson_solaris/home/hudson/hudson-slave/workspace/ZooKeeper_branch35_solaris/build/test/lib/commons-collections-3.2.2.jar:/zonestorage/hudson_solaris/home/hudson/hudson-slave/workspace/ZooKeeper_branch35_solaris/build/test/lib/commons-lang3-3.4.jar:/zonestorage/hudson_solaris/home/hudson/hudson-slave/workspace/ZooKeeper_branch35_solaris/build/test/lib/commons-logging-1.1.1.jar:/zonestorage/hudson_solaris/home/hudson/hudson-slave/workspace/ZooKeeper_branch35_solaris/build/test/lib/guava-18.0.jar:/zonestorage/hudson_solaris/home/hudson/hudson-slave/workspace/ZooKeeper_branch35_solaris/build/test/lib/hamcrest-core-1.3.jar:/zonestorage/hudson_solaris/home/hudson/hudson-slave/workspace/ZooKeeper_branch35_solaris/build/test/lib/junit-4.12.jar:/zonestorage/hudson_solaris/home/hudson/hudson-slave/workspace/ZooKeeper_branch35_solaris/build/test/lib/mockito-all-1.8.2.jar:/zonestorage/hudson_solaris/home/hudson/hudson-slave/workspace/ZooKeeper_branch35_solaris/build/classes:/zonestorage/hudson_solaris/home/hudson/hudson-slave/workspace/ZooKeeper_branch35_solaris/src/java/lib/ivy-2.4.0.jar:/home/jenkins/tools/ant/latest/lib/ant.jar:/zonestorage/hudson_solaris/home/hudson/hudson-slave/workspace/ZooKeeper_branch35_solaris/build/lib/commons-cli-1.2.jar:/zonestorage/hudson_solaris/home/hudson/hudson-slave/workspace/ZooKeeper_branch35_solaris/build/lib/jackson-core-asl-1.9.11.jar:/zonestorage/hudson_solaris/home/hudson/hudson-slave/workspace/ZooKeeper_branch35_solaris/build/lib/jackson-mapper-asl-1.9.11.jar:/zonestorage/hudson_solaris/home/hudson/hudson-slave/workspace/ZooKeeper_branch35_solaris/build/lib/javacc.jar:/zonestorage/hudson_solaris/home/hudson/hudson-slave/workspace/ZooKeeper_branch35_solaris/build/lib/javax.servlet-api-3.1.0.jar:/zonestorage/hudson_solaris/home/hudson/hudson-slave/workspace/ZooKeeper_branch35_solaris/build/lib/jetty-http-9.2.18.v20160721.jar:/zonestorage/hudson_solaris/home/hudson/hudson-slave/workspace/ZooKeeper_branch35_solaris/build/lib/jetty-io-9.2.18.v20160721.jar:/zonestorage/hudson_solaris/home/hudson/hudson-slave/workspace/ZooKeeper_branch35_solaris/build/lib/jetty-security-9.2.18.v20160721.jar:/zonestorage/hudson_solaris/home/hudson/hudson-slave/workspace/ZooKeeper_branch35_solaris/build/lib/jetty-server-9.2.18.v20160721.jar:/zonestorage/hudson_solaris/home/hudson/hudson-slave/workspace/ZooKeeper_branch35_solaris/build/lib/jetty-servlet-9.2.18.v20160721.jar:/zonestorage/hudson_solaris/home/hudson/hudson-slave/workspace/ZooKeeper_branch35_solaris/build/lib/jetty-util-9.2.18.v20160721.jar:/zonestorage/hudson_solaris/home/hudson/hudson-slave/workspace/ZooKeeper_branch35_solaris/build/lib/jline-2.11.jar:/zonestorage/hudson_solaris/home/hudson/hudson-slave/workspace/ZooKeeper_branch35_solaris/build/lib/log4j-1.2.17.jar:/zonestorage/hudson_solaris/home/hudson/hudson-slave/workspace/ZooKeeper_branch35_solaris/build/lib/netty-3.10.5.Final.jar:/zonestorage/hudson_solaris/home/hudson/hudson-slave/workspace/ZooKeeper_branch35_solaris/build/lib/slf4j-api-1.7.5.jar:/zonestorage/hudson_solaris/home/hudson/hudson-slave/workspace/ZooKeeper_branch35_solaris/build/lib/slf4j-log4j12-1.7.5.jar:/zonestorage/hudson_solaris/home/hudson/tools/ant/apache-ant-1.8.2/lib/ant-launcher.jar:/home/jenkins/tools/ant/latest/lib/ant-junit.jar:/home/jenkins/tools/ant/latest/lib/ant-junit4.jar
    [junit] 2017-02-10 16:37:09,678 [myid:] - INFO  [main:Environment@109] - Server environment:java.library.path=/usr/jdk/packages/lib/i386:/lib:/usr/lib
    [junit] 2017-02-10 16:37:09,678 [myid:] - INFO  [main:Environment@109] - Server environment:java.io.tmpdir=/var/tmp/
    [junit] 2017-02-10 16:37:09,678 [myid:] - INFO  [main:Environment@109] - Server environment:java.compiler=<NA>
    [junit] 2017-02-10 16:37:09,678 [myid:] - INFO  [main:Environment@109] - Server environment:os.name=SunOS
    [junit] 2017-02-10 16:37:09,678 [myid:] - INFO  [main:Environment@109] - Server environment:os.arch=x86
    [junit] 2017-02-10 16:37:09,678 [myid:] - INFO  [main:Environment@109] - Server environment:os.version=5.10
    [junit] 2017-02-10 16:37:09,678 [myid:] - INFO  [main:Environment@109] - Server environment:user.name=hudson
    [junit] 2017-02-10 16:37:09,679 [myid:] - INFO  [main:Environment@109] - Server environment:user.home=/export/home/hudson
    [junit] 2017-02-10 16:37:09,679 [myid:] - INFO  [main:Environment@109] - Server environment:user.dir=/zonestorage/hudson_solaris/home/hudson/hudson-slave/workspace/ZooKeeper_branch35_solaris/build/test
    [junit] 2017-02-10 16:37:09,679 [myid:] - INFO  [main:Environment@109] - Server environment:os.memory.free=47MB
    [junit] 2017-02-10 16:37:09,679 [myid:] - INFO  [main:Environment@109] - Server environment:os.memory.max=454MB
    [junit] 2017-02-10 16:37:09,679 [myid:] - INFO  [main:Environment@109] - Server environment:os.memory.total=61MB
    [junit] 2017-02-10 16:37:10,043 [myid:] - INFO  [main:ZooKeeperServer@893] - minSessionTimeout
set to 2000
    [junit] 2017-02-10 16:37:10,044 [myid:] - INFO  [main:ZooKeeperServer@902] - maxSessionTimeout
set to 2000
    [junit] 2017-02-10 16:37:10,054 [myid:] - INFO  [main:ZooKeeperServer@159] - Created server
with tickTime 2000 minSessionTimeout 2000 maxSessionTimeout 2000 datadir /zonestorage/hudson_solaris/home/hudson/hudson-slave/workspace/ZooKeeper_branch35_solaris/build/test/data/test7391747207294105162.dir/version-2
snapdir /zonestorage/hudson_solaris/home/hudson/hudson-slave/workspace/ZooKeeper_branch35_solaris/build/test/data/test7391747207294105162.dir/version-2
    [junit] 2017-02-10 16:37:10,380 [myid:] - INFO  [main:Learner@369] - Getting a snapshot
from leader
    [junit] 2017-02-10 16:37:10,661 [myid:] - WARN  [main:Learner@417] - Got zxid 0x0 expected
0x1
    [junit] 2017-02-10 16:37:10,662 [myid:] - INFO  [main:ZooKeeperServer@893] - minSessionTimeout
set to 2000
    [junit] 2017-02-10 16:37:10,663 [myid:] - INFO  [main:ZooKeeperServer@902] - maxSessionTimeout
set to 2000
    [junit] 2017-02-10 16:37:10,663 [myid:] - INFO  [main:ZooKeeperServer@159] - Created server
with tickTime 2000 minSessionTimeout 2000 maxSessionTimeout 2000 datadir /zonestorage/hudson_solaris/home/hudson/hudson-slave/workspace/ZooKeeper_branch35_solaris/build/test/data/test7391747207294105162.dir/version-2
snapdir /zonestorage/hudson_solaris/home/hudson/hudson-slave/workspace/ZooKeeper_branch35_solaris/build/test/data/test7391747207294105162.dir/version-2
    [junit] 2017-02-10 16:37:11,008 [myid:] - INFO  [main:JUnit4ZKTestRunner$LoggedInvokeMethod@82]
- Memory used 14706
    [junit] 2017-02-10 16:37:11,008 [myid:] - INFO  [main:JUnit4ZKTestRunner$LoggedInvokeMethod@87]
- Number of threads 4
    [junit] 2017-02-10 16:37:11,008 [myid:] - INFO  [main:JUnit4ZKTestRunner$LoggedInvokeMethod@102]
- FINISHED TEST METHOD syncTest
    [junit] 2017-02-10 16:37:11,008 [myid:] - INFO  [main:ZKTestCase$1@65] - SUCCEEDED syncTest
    [junit] 2017-02-10 16:37:11,009 [myid:] - INFO  [main:ZKTestCase$1@60] - FINISHED syncTest
    [junit] Tests run: 3, Failures: 0, Errors: 0, Time elapsed: 19.355 sec
    [junit] Running org.apache.zookeeper.server.quorum.LocalPeerBeanTest
    [junit] 2017-02-10 16:37:30,506 [myid:] - INFO  [main:Log@186] - Logging initialized @12947ms
    [junit] 2017-02-10 16:37:32,996 [myid:] - WARN  [main:ContextHandler@1339] - o.e.j.s.ServletContextHandler@4c98f4{/,null,null}
contextPath ends with /*
    [junit] 2017-02-10 16:37:32,997 [myid:] - WARN  [main:ContextHandler@1350] - Empty contextPath
    [junit] 2017-02-10 16:37:33,929 [myid:] - INFO  [main:PortAssignment@157] - Single test
process using ports from 11221 - 32767.
    [junit] 2017-02-10 16:37:33,986 [myid:] - INFO  [main:PortAssignment@85] - Assigned port
11222 from range 11221 - 32767.
    [junit] 2017-02-10 16:37:34,335 [myid:] - INFO  [main:NIOServerCnxnFactory@673] - Configuring
NIO connection handler with 10s sessionless connection timeout, 2 selector thread(s), 16 worker
threads, and 64 kB direct buffers.
    [junit] 2017-02-10 16:37:34,990 [myid:] - INFO  [main:NIOServerCnxnFactory@686] - binding
to port 0.0.0.0/0.0.0.0:11222
    [junit] 2017-02-10 16:37:35,072 [myid:] - INFO  [main:PortAssignment@85] - Assigned port
11223 from range 11221 - 32767.
    [junit] 2017-02-10 16:37:35,073 [myid:] - INFO  [main:NIOServerCnxnFactory@673] - Configuring
NIO connection handler with 10s sessionless connection timeout, 2 selector thread(s), 16 worker
threads, and 64 kB direct buffers.
    [junit] 2017-02-10 16:37:35,108 [myid:] - INFO  [main:NIOServerCnxnFactory@686] - binding
to port localhost/127.0.0.1:11223
    [junit] Tests run: 1, Failures: 0, Errors: 0, Time elapsed: 11.343 sec
    [junit] Running org.apache.zookeeper.server.quorum.QuorumPeerConfigTest
    [junit] Tests run: 1, Failures: 0, Errors: 1, Time elapsed: 0 sec

BUILD FAILED
/zonestorage/hudson_solaris/home/hudson/hudson-slave/workspace/ZooKeeper_branch35_solaris/build.xml:1227:
Process fork failed.

Total time: 26 minutes 25 seconds
Build step 'Invoke Ant' marked build as failure
[locks-and-latches] Releasing all the locks
[locks-and-latches] All the locks released
Recording test results
Email was triggered for: Failure - Any
Sending email for trigger: Failure - Any



###################################################################################
############################## FAILED TESTS (if any) ##############################
2 tests failed.
FAILED:  org.apache.zookeeper.server.admin.JettyAdminServerTest.testQuorum

Error Message:
Connection refused

Stack Trace:
java.net.ConnectException: Connection refused
	at java.net.PlainSocketImpl.socketConnect(Native Method)
	at java.net.AbstractPlainSocketImpl.doConnect(AbstractPlainSocketImpl.java:339)
	at java.net.AbstractPlainSocketImpl.connectToAddress(AbstractPlainSocketImpl.java:200)
	at java.net.AbstractPlainSocketImpl.connect(AbstractPlainSocketImpl.java:182)
	at java.net.SocksSocketImpl.connect(SocksSocketImpl.java:392)
	at java.net.Socket.connect(Socket.java:579)
	at java.net.Socket.connect(Socket.java:528)
	at sun.net.NetworkClient.doConnect(NetworkClient.java:180)
	at sun.net.www.http.HttpClient.openServer(HttpClient.java:432)
	at sun.net.www.http.HttpClient.openServer(HttpClient.java:527)
	at sun.net.www.http.HttpClient.<init>(HttpClient.java:211)
	at sun.net.www.http.HttpClient.New(HttpClient.java:308)
	at sun.net.www.http.HttpClient.New(HttpClient.java:326)
	at sun.net.www.protocol.http.HttpURLConnection.getNewHttpClient(HttpURLConnection.java:997)
	at sun.net.www.protocol.http.HttpURLConnection.plainConnect(HttpURLConnection.java:933)
	at sun.net.www.protocol.http.HttpURLConnection.connect(HttpURLConnection.java:851)
	at sun.net.www.protocol.http.HttpURLConnection.getInputStream(HttpURLConnection.java:1301)
	at java.net.URL.openStream(URL.java:1037)
	at org.apache.zookeeper.server.admin.JettyAdminServerTest.queryAdminServer(JettyAdminServerTest.java:158)
	at org.apache.zookeeper.server.admin.JettyAdminServerTest.queryAdminServer(JettyAdminServerTest.java:150)
	at org.apache.zookeeper.server.admin.JettyAdminServerTest.testQuorum(JettyAdminServerTest.java:131)
	at org.apache.zookeeper.JUnit4ZKTestRunner$LoggedInvokeMethod.evaluate(JUnit4ZKTestRunner.java:79)


FAILED:  org.apache.zookeeper.server.quorum.QuorumPeerConfigTest.unknown

Error Message:
Forked Java VM exited abnormally. Please note the time in the report does not reflect the
time until the VM exit.

Stack Trace:
junit.framework.AssertionFailedError: Forked Java VM exited abnormally. Please note the time
in the report does not reflect the time until the VM exit.



Mime
  • Unnamed multipart/mixed (inline, None, 0 bytes)
View raw message