zookeeper-dev mailing list archives

Site index · List index
Message view « Date » · « Thread »
Top « Date » · « Thread »
From Apache Jenkins Server <jenk...@builds.apache.org>
Subject ZooKeeper_branch35_solaris - Build # 431 - Still Failing
Date Fri, 10 Feb 2017 20:35:11 GMT
See https://builds.apache.org/job/ZooKeeper_branch35_solaris/431/

###################################################################################
########################## LAST 60 LINES OF THE CONSOLE ###########################
[...truncated 209563 lines...]
    [junit] 	at org.apache.zookeeper.server.quorum.Leader.lead(Leader.java:563)
    [junit] 	at org.apache.zookeeper.server.quorum.QuorumPeer.run(QuorumPeer.java:1146)
    [junit] 2017-02-10 20:35:56,830 [myid:] - INFO  [main:QuorumBase@403] - Waiting for QuorumPeer[myid=5](plain=/127.0.0.1:11253)(secure=disabled)
to exit thread
    [junit] 2017-02-10 20:35:56,830 [myid:] - INFO  [QuorumPeer[myid=5](plain=/127.0.0.1:11253)(secure=disabled):Leader@625]
- Shutting down
    [junit] 2017-02-10 20:35:56,831 [myid:] - WARN  [QuorumPeer[myid=5](plain=/127.0.0.1:11253)(secure=disabled):QuorumPeer@1180]
- PeerState set to LOOKING
    [junit] 2017-02-10 20:35:56,831 [myid:] - WARN  [QuorumPeer[myid=5](plain=/127.0.0.1:11253)(secure=disabled):QuorumPeer@1162]
- QuorumPeer main thread exited
    [junit] 2017-02-10 20:35:56,831 [myid:] - INFO  [QuorumPeer[myid=5](plain=/127.0.0.1:11253)(secure=disabled):MBeanRegistry@128]
- Unregister MBean [org.apache.ZooKeeperService:name0=ReplicatedServer_id5]
    [junit] 2017-02-10 20:35:56,831 [myid:] - INFO  [QuorumPeer[myid=5](plain=/127.0.0.1:11253)(secure=disabled):MBeanRegistry@128]
- Unregister MBean [org.apache.ZooKeeperService:name0=ReplicatedServer_id5,name1=replica.5]
    [junit] 2017-02-10 20:35:56,831 [myid:] - INFO  [QuorumPeer[myid=5](plain=/127.0.0.1:11253)(secure=disabled):MBeanRegistry@128]
- Unregister MBean [org.apache.ZooKeeperService:name0=ReplicatedServer_id5,name1=replica.1]
    [junit] 2017-02-10 20:35:56,831 [myid:] - INFO  [QuorumPeer[myid=5](plain=/127.0.0.1:11253)(secure=disabled):MBeanRegistry@128]
- Unregister MBean [org.apache.ZooKeeperService:name0=ReplicatedServer_id5,name1=replica.2]
    [junit] 2017-02-10 20:35:56,831 [myid:] - INFO  [QuorumPeer[myid=5](plain=/127.0.0.1:11253)(secure=disabled):MBeanRegistry@128]
- Unregister MBean [org.apache.ZooKeeperService:name0=ReplicatedServer_id5,name1=replica.3]
    [junit] 2017-02-10 20:35:56,831 [myid:] - INFO  [QuorumPeer[myid=5](plain=/127.0.0.1:11253)(secure=disabled):MBeanRegistry@128]
- Unregister MBean [org.apache.ZooKeeperService:name0=ReplicatedServer_id5,name1=replica.4]
    [junit] 2017-02-10 20:35:56,831 [myid:] - INFO  [main:JUnit4ZKTestRunner$LoggedInvokeMethod@82]
- Memory used 19810
    [junit] 2017-02-10 20:35:56,832 [myid:] - INFO  [main:JUnit4ZKTestRunner$LoggedInvokeMethod@87]
- Number of threads 20
    [junit] 2017-02-10 20:35:56,832 [myid:] - INFO  [main:JUnit4ZKTestRunner$LoggedInvokeMethod@102]
- FINISHED TEST METHOD testLocalSessionsOnFollower
    [junit] 2017-02-10 20:35:56,832 [myid:] - INFO  [main:LocalSessionRequestTest@59] - STOPPING
quorum org.apache.zookeeper.test.LocalSessionRequestTest
    [junit] 2017-02-10 20:35:56,832 [myid:] - INFO  [main:QuorumBase@362] - TearDown started
    [junit] 2017-02-10 20:35:56,832 [myid:] - INFO  [main:QuorumBase@366] - fdcount after
test is: 60
    [junit] 2017-02-10 20:35:56,832 [myid:] - INFO  [main:QuorumBase@394] - Shutting down
quorum peer QuorumPeer[myid=1](plain=/127.0.0.1:11249)(secure=disabled)
    [junit] 2017-02-10 20:35:56,832 [myid:] - INFO  [main:QuorumBase@398] - Shutting down
leader election QuorumPeer[myid=1](plain=/127.0.0.1:11249)(secure=disabled)
    [junit] 2017-02-10 20:35:56,832 [myid:] - INFO  [main:QuorumBase@403] - Waiting for QuorumPeer[myid=1](plain=/127.0.0.1:11249)(secure=disabled)
to exit thread
    [junit] 2017-02-10 20:35:56,832 [myid:] - INFO  [main:QuorumBase@394] - Shutting down
quorum peer QuorumPeer[myid=2](plain=/127.0.0.1:11250)(secure=disabled)
    [junit] 2017-02-10 20:35:56,833 [myid:] - INFO  [main:QuorumBase@398] - Shutting down
leader election QuorumPeer[myid=2](plain=/127.0.0.1:11250)(secure=disabled)
    [junit] 2017-02-10 20:35:56,833 [myid:] - INFO  [main:QuorumBase@403] - Waiting for QuorumPeer[myid=2](plain=/127.0.0.1:11250)(secure=disabled)
to exit thread
    [junit] 2017-02-10 20:35:56,833 [myid:] - INFO  [main:QuorumBase@394] - Shutting down
quorum peer QuorumPeer[myid=3](plain=/127.0.0.1:11251)(secure=disabled)
    [junit] 2017-02-10 20:35:56,833 [myid:] - INFO  [main:QuorumBase@398] - Shutting down
leader election QuorumPeer[myid=3](plain=/127.0.0.1:11251)(secure=disabled)
    [junit] 2017-02-10 20:35:56,833 [myid:] - INFO  [main:QuorumBase@403] - Waiting for QuorumPeer[myid=3](plain=/127.0.0.1:11251)(secure=disabled)
to exit thread
    [junit] 2017-02-10 20:35:56,833 [myid:] - INFO  [main:QuorumBase@394] - Shutting down
quorum peer QuorumPeer[myid=4](plain=/127.0.0.1:11252)(secure=disabled)
    [junit] 2017-02-10 20:35:56,833 [myid:] - INFO  [main:QuorumBase@398] - Shutting down
leader election QuorumPeer[myid=4](plain=/127.0.0.1:11252)(secure=disabled)
    [junit] 2017-02-10 20:35:56,833 [myid:] - INFO  [main:QuorumBase@403] - Waiting for QuorumPeer[myid=4](plain=/127.0.0.1:11252)(secure=disabled)
to exit thread
    [junit] 2017-02-10 20:35:56,833 [myid:] - INFO  [main:QuorumBase@394] - Shutting down
quorum peer QuorumPeer[myid=5](plain=/127.0.0.1:11253)(secure=disabled)
    [junit] 2017-02-10 20:35:56,834 [myid:] - INFO  [main:QuorumBase@398] - Shutting down
leader election QuorumPeer[myid=5](plain=/127.0.0.1:11253)(secure=disabled)
    [junit] 2017-02-10 20:35:56,834 [myid:] - INFO  [main:QuorumBase@403] - Waiting for QuorumPeer[myid=5](plain=/127.0.0.1:11253)(secure=disabled)
to exit thread
    [junit] 2017-02-10 20:35:56,834 [myid:] - INFO  [main:FourLetterWordMain@85] - connecting
to 127.0.0.1 11249
    [junit] 2017-02-10 20:35:56,834 [myid:] - INFO  [main:QuorumBase@376] - 127.0.0.1:11249
is no longer accepting client connections
    [junit] 2017-02-10 20:35:56,834 [myid:] - INFO  [main:FourLetterWordMain@85] - connecting
to 127.0.0.1 11250
    [junit] 2017-02-10 20:35:56,834 [myid:] - INFO  [main:QuorumBase@376] - 127.0.0.1:11250
is no longer accepting client connections
    [junit] 2017-02-10 20:35:56,835 [myid:] - INFO  [main:FourLetterWordMain@85] - connecting
to 127.0.0.1 11251
    [junit] 2017-02-10 20:35:56,835 [myid:] - INFO  [main:QuorumBase@376] - 127.0.0.1:11251
is no longer accepting client connections
    [junit] 2017-02-10 20:35:56,891 [myid:] - INFO  [main:FourLetterWordMain@85] - connecting
to 127.0.0.1 11252
    [junit] 2017-02-10 20:35:56,891 [myid:] - INFO  [main:QuorumBase@376] - 127.0.0.1:11252
is no longer accepting client connections
    [junit] 2017-02-10 20:35:56,891 [myid:] - INFO  [main:FourLetterWordMain@85] - connecting
to 127.0.0.1 11253
    [junit] 2017-02-10 20:35:56,891 [myid:] - INFO  [main:QuorumBase@376] - 127.0.0.1:11253
is no longer accepting client connections
    [junit] 2017-02-10 20:35:56,892 [myid:] - INFO  [main:ZKTestCase$1@65] - SUCCEEDED testLocalSessionsOnFollower
    [junit] 2017-02-10 20:35:56,893 [myid:] - INFO  [main:ZKTestCase$1@60] - FINISHED testLocalSessionsOnFollower
    [junit] Tests run: 2, Failures: 0, Errors: 0, Time elapsed: 70.651 sec
    [junit] Running org.apache.zookeeper.test.LocalSessionsOnlyTest
    [junit] Tests run: 1, Failures: 0, Errors: 1, Time elapsed: 0 sec

BUILD FAILED
/zonestorage/hudson_solaris/home/hudson/hudson-slave/workspace/ZooKeeper_branch35_solaris/build.xml:1227:
Process fork failed.

Total time: 66 minutes 22 seconds
Build step 'Invoke Ant' marked build as failure
[locks-and-latches] Releasing all the locks
[locks-and-latches] All the locks released
Recording test results
Email was triggered for: Failure - Any
Sending email for trigger: Failure - Any



###################################################################################
############################## FAILED TESTS (if any) ##############################
8 tests failed.
FAILED:  org.apache.zookeeper.server.quorum.StandaloneDisabledTest.startSingleServerTest

Error Message:
Timeout occurred. Please note the time in the report does not reflect the time until the timeout.

Stack Trace:
junit.framework.AssertionFailedError: Timeout occurred. Please note the time in the report
does not reflect the time until the timeout.


FAILED:  org.apache.zookeeper.test.FLENewEpochTest.testLENewEpoch

Error Message:
First leader election failed

Stack Trace:
junit.framework.AssertionFailedError: First leader election failed
	at org.apache.zookeeper.test.FLENewEpochTest.testLENewEpoch(FLENewEpochTest.java:175)
	at org.apache.zookeeper.JUnit4ZKTestRunner$LoggedInvokeMethod.evaluate(JUnit4ZKTestRunner.java:79)


FAILED:  org.apache.zookeeper.test.FourLetterWordsTest.testFourLetterWords

Error Message:
test timed out after 30000 milliseconds

Stack Trace:
	at java.net.SocketInputStream.socketRead0(Native Method)
	at java.net.SocketInputStream.read(SocketInputStream.java:152)
	at java.net.SocketInputStream.read(SocketInputStream.java:122)
	at sun.nio.cs.StreamDecoder.readBytes(StreamDecoder.java:283)
	at sun.nio.cs.StreamDecoder.implRead(StreamDecoder.java:325)
	at sun.nio.cs.StreamDecoder.read(StreamDecoder.java:177)
	at java.io.InputStreamReader.read(InputStreamReader.java:184)
	at java.io.BufferedReader.fill(BufferedReader.java:154)
	at java.io.BufferedReader.readLine(BufferedReader.java:317)
	at java.io.BufferedReader.readLine(BufferedReader.java:382)
	at org.apache.zookeeper.client.FourLetterWordMain.send4LetterWord(FourLetterWordMain.java:119)
	at org.apache.zookeeper.client.FourLetterWordMain.send4LetterWord(FourLetterWordMain.java:69)
	at org.apache.zookeeper.test.ClientBase.waitForServerUp(ClientBase.java:241)
	at org.apache.zookeeper.test.ClientBase.startServerInstance(ClientBase.java:364)
	at org.apache.zookeeper.test.ClientBase.startServer(ClientBase.java:469)
	at org.apache.zookeeper.test.ClientBase.setUp(ClientBase.java:460)
	at java.util.concurrent.FutureTask.run(FutureTask.java:262)
	at java.lang.Thread.run(Thread.java:745)


FAILED:  org.apache.zookeeper.test.FourLetterWordsTest.testSetTraceMask

Error Message:
Unexpected bean exists! expected:<0> but was:<2>

Stack Trace:
junit.framework.AssertionFailedError: Unexpected bean exists! expected:<0> but was:<2>
	at org.apache.zookeeper.test.ClientBase.verifyUnexpectedBeans(ClientBase.java:498)
	at org.apache.zookeeper.test.ClientBase.startServer(ClientBase.java:477)
	at org.apache.zookeeper.test.ClientBase.setUp(ClientBase.java:460)
	at java.util.concurrent.FutureTask.run(FutureTask.java:262)
	at java.lang.Thread.run(Thread.java:745)


FAILED:  org.apache.zookeeper.test.FourLetterWordsTest.testValidateConsOutput

Error Message:
Unexpected bean exists! expected:<0> but was:<2>

Stack Trace:
junit.framework.AssertionFailedError: Unexpected bean exists! expected:<0> but was:<2>
	at org.apache.zookeeper.test.ClientBase.verifyUnexpectedBeans(ClientBase.java:498)
	at org.apache.zookeeper.test.ClientBase.startServer(ClientBase.java:477)
	at org.apache.zookeeper.test.ClientBase.setUp(ClientBase.java:460)
	at java.util.concurrent.FutureTask.run(FutureTask.java:262)
	at java.lang.Thread.run(Thread.java:745)


FAILED:  org.apache.zookeeper.test.FourLetterWordsTest.testValidateSocketTimeout

Error Message:
Unexpected bean exists! expected:<0> but was:<2>

Stack Trace:
junit.framework.AssertionFailedError: Unexpected bean exists! expected:<0> but was:<2>
	at org.apache.zookeeper.test.ClientBase.verifyUnexpectedBeans(ClientBase.java:498)
	at org.apache.zookeeper.test.ClientBase.startServer(ClientBase.java:477)
	at org.apache.zookeeper.test.ClientBase.setUp(ClientBase.java:460)
	at java.util.concurrent.FutureTask.run(FutureTask.java:262)
	at java.lang.Thread.run(Thread.java:745)


FAILED:  org.apache.zookeeper.test.FourLetterWordsTest.testValidateStatOutput

Error Message:
Unexpected bean exists! expected:<0> but was:<2>

Stack Trace:
junit.framework.AssertionFailedError: Unexpected bean exists! expected:<0> but was:<2>
	at org.apache.zookeeper.test.ClientBase.verifyUnexpectedBeans(ClientBase.java:498)
	at org.apache.zookeeper.test.ClientBase.startServer(ClientBase.java:477)
	at org.apache.zookeeper.test.ClientBase.setUp(ClientBase.java:460)
	at java.util.concurrent.FutureTask.run(FutureTask.java:262)
	at java.lang.Thread.run(Thread.java:745)


FAILED:  org.apache.zookeeper.test.LocalSessionsOnlyTest.unknown

Error Message:
Forked Java VM exited abnormally. Please note the time in the report does not reflect the
time until the VM exit.

Stack Trace:
junit.framework.AssertionFailedError: Forked Java VM exited abnormally. Please note the time
in the report does not reflect the time until the VM exit.



Mime
  • Unnamed multipart/mixed (inline, None, 0 bytes)
View raw message