zookeeper-dev mailing list archives

Site index · List index
Message view « Date » · « Thread »
Top « Date » · « Thread »
From Apache Jenkins Server <jenk...@builds.apache.org>
Subject ZooKeeper_branch35_jdk7 - Build # 836 - Still Failing
Date Tue, 07 Feb 2017 02:51:29 GMT
See https://builds.apache.org/job/ZooKeeper_branch35_jdk7/836/

###################################################################################
########################## LAST 60 LINES OF THE CONSOLE ###########################
[...truncated 484927 lines...]
    [junit] 2017-02-07 02:51:24,127 [myid:] - ERROR [main:ZooKeeperServer@505] - ZKShutdownHandler
is not registered, so ZooKeeper server won't take any action on ERROR or SHUTDOWN server state
changes
    [junit] 2017-02-07 02:51:24,128 [myid:] - INFO  [main:SessionTrackerImpl@232] - Shutting
down
    [junit] 2017-02-07 02:51:24,128 [myid:] - INFO  [main:PrepRequestProcessor@974] - Shutting
down
    [junit] 2017-02-07 02:51:24,128 [myid:] - INFO  [main:SyncRequestProcessor@191] - Shutting
down
    [junit] 2017-02-07 02:51:24,128 [myid:] - INFO  [ProcessThread(sid:0 cport:22240)::PrepRequestProcessor@154]
- PrepRequestProcessor exited loop!
    [junit] 2017-02-07 02:51:24,128 [myid:] - INFO  [SyncThread:0:SyncRequestProcessor@169]
- SyncRequestProcessor exited!
    [junit] 2017-02-07 02:51:24,128 [myid:] - INFO  [main:FinalRequestProcessor@479] - shutdown
of request processor complete
    [junit] 2017-02-07 02:51:24,139 [myid:] - INFO  [main:MBeanRegistry@128] - Unregister
MBean [org.apache.ZooKeeperService:name0=StandaloneServer_port22240,name1=InMemoryDataTree]
    [junit] 2017-02-07 02:51:24,139 [myid:] - INFO  [main:MBeanRegistry@128] - Unregister
MBean [org.apache.ZooKeeperService:name0=StandaloneServer_port22240]
    [junit] 2017-02-07 02:51:24,140 [myid:] - INFO  [main:FourLetterWordMain@85] - connecting
to 127.0.0.1 22240
    [junit] 2017-02-07 02:51:24,140 [myid:] - INFO  [main:JMXEnv@146] - ensureOnly:[]
    [junit] 2017-02-07 02:51:24,146 [myid:] - INFO  [main:ClientBase@568] - fdcount after
test is: 5216 at start it was 5216
    [junit] 2017-02-07 02:51:24,146 [myid:] - INFO  [main:ZKTestCase$1@65] - SUCCEEDED testWatcherAutoResetWithLocal
    [junit] 2017-02-07 02:51:24,146 [myid:] - INFO  [main:ZKTestCase$1@60] - FINISHED testWatcherAutoResetWithLocal
    [junit] Tests run: 103, Failures: 0, Errors: 0, Skipped: 0, Time elapsed: 544.022 sec,
Thread: 5, Class: org.apache.zookeeper.test.NettyNettySuiteTest
    [junit] 2017-02-07 02:51:24,464 [myid:] - INFO  [SessionTracker:SessionTrackerImpl@158]
- SessionTrackerImpl exited loop!
    [junit] 2017-02-07 02:51:24,666 [myid:127.0.0.1:22123] - INFO  [main-SendThread(127.0.0.1:22123):ClientCnxn$SendThread@1113]
- Opening socket connection to server 127.0.0.1/127.0.0.1:22123. Will not attempt to authenticate
using SASL (unknown error)
    [junit] 2017-02-07 02:51:24,667 [myid:] - INFO  [New I/O boss #10197:ClientCnxnSocketNetty$1@127]
- future isn't success, cause: {}
    [junit] java.net.ConnectException: Connection refused: 127.0.0.1/127.0.0.1:22123
    [junit] 	at sun.nio.ch.SocketChannelImpl.checkConnect(Native Method)
    [junit] 	at sun.nio.ch.SocketChannelImpl.finishConnect(SocketChannelImpl.java:744)
    [junit] 	at org.jboss.netty.channel.socket.nio.NioClientBoss.connect(NioClientBoss.java:152)
    [junit] 	at org.jboss.netty.channel.socket.nio.NioClientBoss.processSelectedKeys(NioClientBoss.java:105)
    [junit] 	at org.jboss.netty.channel.socket.nio.NioClientBoss.process(NioClientBoss.java:79)
    [junit] 	at org.jboss.netty.channel.socket.nio.AbstractNioSelector.run(AbstractNioSelector.java:337)
    [junit] 	at org.jboss.netty.channel.socket.nio.NioClientBoss.run(NioClientBoss.java:42)
    [junit] 	at org.jboss.netty.util.ThreadRenamingRunnable.run(ThreadRenamingRunnable.java:108)
    [junit] 	at org.jboss.netty.util.internal.DeadLockProofWorker$1.run(DeadLockProofWorker.java:42)
    [junit] 	at java.util.concurrent.ThreadPoolExecutor.runWorker(ThreadPoolExecutor.java:1145)
    [junit] 	at java.util.concurrent.ThreadPoolExecutor$Worker.run(ThreadPoolExecutor.java:615)
    [junit] 	at java.lang.Thread.run(Thread.java:745)
    [junit] 2017-02-07 02:51:24,667 [myid:] - WARN  [New I/O boss #10197:ClientCnxnSocketNetty$ZKClientHandler@439]
- Exception caught: [id: 0xe998ef66] EXCEPTION: java.net.ConnectException: Connection refused:
127.0.0.1/127.0.0.1:22123
    [junit] java.net.ConnectException: Connection refused: 127.0.0.1/127.0.0.1:22123
    [junit] 	at sun.nio.ch.SocketChannelImpl.checkConnect(Native Method)
    [junit] 	at sun.nio.ch.SocketChannelImpl.finishConnect(SocketChannelImpl.java:744)
    [junit] 	at org.jboss.netty.channel.socket.nio.NioClientBoss.connect(NioClientBoss.java:152)
    [junit] 	at org.jboss.netty.channel.socket.nio.NioClientBoss.processSelectedKeys(NioClientBoss.java:105)
    [junit] 	at org.jboss.netty.channel.socket.nio.NioClientBoss.process(NioClientBoss.java:79)
    [junit] 	at org.jboss.netty.channel.socket.nio.AbstractNioSelector.run(AbstractNioSelector.java:337)
    [junit] 	at org.jboss.netty.channel.socket.nio.NioClientBoss.run(NioClientBoss.java:42)
    [junit] 	at org.jboss.netty.util.ThreadRenamingRunnable.run(ThreadRenamingRunnable.java:108)
    [junit] 	at org.jboss.netty.util.internal.DeadLockProofWorker$1.run(DeadLockProofWorker.java:42)
    [junit] 	at java.util.concurrent.ThreadPoolExecutor.runWorker(ThreadPoolExecutor.java:1145)
    [junit] 	at java.util.concurrent.ThreadPoolExecutor$Worker.run(ThreadPoolExecutor.java:615)
    [junit] 	at java.lang.Thread.run(Thread.java:745)
    [junit] 2017-02-07 02:51:24,668 [myid:] - INFO  [New I/O boss #10197:ClientCnxnSocketNetty@208]
- channel is told closing
    [junit] 2017-02-07 02:51:24,668 [myid:127.0.0.1:22123] - INFO  [main-SendThread(127.0.0.1:22123):ClientCnxn$SendThread@1231]
- channel for sessionid 0x3022e02f9600000 is lost, closing socket connection and attempting
reconnect

fail.build.on.test.failure:

BUILD FAILED
/home/jenkins/jenkins-slave/workspace/ZooKeeper_branch35_jdk7/build.xml:1211: The following
error occurred while executing this line:
/home/jenkins/jenkins-slave/workspace/ZooKeeper_branch35_jdk7/build.xml:1215: Tests failed!

Total time: 13 minutes 13 seconds
Build step 'Invoke Ant' marked build as failure
Recording test results
Email was triggered for: Failure - Any
Sending email for trigger: Failure - Any



###################################################################################
############################## FAILED TESTS (if any) ##############################
1 tests failed.
FAILED:  org.apache.zookeeper.server.quorum.ReconfigDuringLeaderSyncTest.testDuringLeaderSync

Error Message:
zoo.cfg.dynamic.next is not deleted.

Stack Trace:
junit.framework.AssertionFailedError: zoo.cfg.dynamic.next is not deleted.
	at org.apache.zookeeper.server.quorum.ReconfigDuringLeaderSyncTest.testDuringLeaderSync(ReconfigDuringLeaderSyncTest.java:165)
	at org.apache.zookeeper.JUnit4ZKTestRunner$LoggedInvokeMethod.evaluate(JUnit4ZKTestRunner.java:79)



Mime
  • Unnamed multipart/mixed (inline, None, 0 bytes)
View raw message