zookeeper-dev mailing list archives

Site index · List index
Message view « Date » · « Thread »
Top « Date » · « Thread »
From Apache Jenkins Server <jenk...@builds.apache.org>
Subject ZooKeeper-trunk-solaris - Build # 1490 - Still Failing
Date Sat, 04 Feb 2017 08:26:36 GMT
See https://builds.apache.org/job/ZooKeeper-trunk-solaris/1490/

###################################################################################
########################## LAST 60 LINES OF THE CONSOLE ###########################
[...truncated 457092 lines...]
    [junit] 2017-02-04 08:25:58,346 [myid:] - INFO  [main:ClientBase@401] - CREATING server
instance 127.0.0.1:11222
    [junit] 2017-02-04 08:25:58,346 [myid:] - INFO  [main:NIOServerCnxnFactory@673] - Configuring
NIO connection handler with 10s sessionless connection timeout, 2 selector thread(s), 16 worker
threads, and 64 kB direct buffers.
    [junit] 2017-02-04 08:25:58,347 [myid:] - INFO  [main:NIOServerCnxnFactory@686] - binding
to port 0.0.0.0/0.0.0.0:11222
    [junit] 2017-02-04 08:25:58,348 [myid:] - INFO  [main:ClientBase@376] - STARTING server
instance 127.0.0.1:11222
    [junit] 2017-02-04 08:25:58,348 [myid:] - INFO  [main:ZooKeeperServer@894] - minSessionTimeout
set to 6000
    [junit] 2017-02-04 08:25:58,348 [myid:] - INFO  [main:ZooKeeperServer@903] - maxSessionTimeout
set to 60000
    [junit] 2017-02-04 08:25:58,348 [myid:] - INFO  [main:ZooKeeperServer@160] - Created server
with tickTime 3000 minSessionTimeout 6000 maxSessionTimeout 60000 datadir /zonestorage/hudson_solaris/home/hudson/hudson-slave/workspace/ZooKeeper-trunk-solaris/build/test/tmp/test8968323702041501356.junit.dir/version-2
snapdir /zonestorage/hudson_solaris/home/hudson/hudson-slave/workspace/ZooKeeper-trunk-solaris/build/test/tmp/test8968323702041501356.junit.dir/version-2
    [junit] 2017-02-04 08:25:58,349 [myid:] - INFO  [main:FileSnap@83] - Reading snapshot
/zonestorage/hudson_solaris/home/hudson/hudson-slave/workspace/ZooKeeper-trunk-solaris/build/test/tmp/test8968323702041501356.junit.dir/version-2/snapshot.b
    [junit] 2017-02-04 08:25:58,351 [myid:] - INFO  [main:FileTxnSnapLog@346] - Snapshotting:
0xb to /zonestorage/hudson_solaris/home/hudson/hudson-slave/workspace/ZooKeeper-trunk-solaris/build/test/tmp/test8968323702041501356.junit.dir/version-2/snapshot.b
    [junit] 2017-02-04 08:25:58,352 [myid:] - ERROR [main:ZooKeeperServer@506] - ZKShutdownHandler
is not registered, so ZooKeeper server won't take any action on ERROR or SHUTDOWN server state
changes
    [junit] 2017-02-04 08:25:58,352 [myid:] - INFO  [main:FourLetterWordMain@85] - connecting
to 127.0.0.1 11222
    [junit] 2017-02-04 08:25:58,353 [myid:] - INFO  [NIOServerCxnFactory.AcceptThread:0.0.0.0/0.0.0.0:11222:NIOServerCnxnFactory$AcceptThread@296]
- Accepted socket connection from /127.0.0.1:37694
    [junit] 2017-02-04 08:25:58,353 [myid:] - INFO  [NIOWorkerThread-1:NIOServerCnxn@485]
- Processing stat command from /127.0.0.1:37694
    [junit] 2017-02-04 08:25:58,354 [myid:] - INFO  [NIOWorkerThread-1:StatCommand@49] - Stat
command output
    [junit] 2017-02-04 08:25:58,354 [myid:] - INFO  [NIOWorkerThread-1:NIOServerCnxn@614]
- Closed socket connection for client /127.0.0.1:37694 (no session established for client)
    [junit] 2017-02-04 08:25:58,354 [myid:] - INFO  [main:JMXEnv@228] - ensureParent:[InMemoryDataTree,
StandaloneServer_port]
    [junit] 2017-02-04 08:25:58,355 [myid:] - INFO  [main:JMXEnv@245] - expect:InMemoryDataTree
    [junit] 2017-02-04 08:25:58,356 [myid:] - INFO  [main:JMXEnv@249] - found:InMemoryDataTree
org.apache.ZooKeeperService:name0=StandaloneServer_port11222,name1=InMemoryDataTree
    [junit] 2017-02-04 08:25:58,356 [myid:] - INFO  [main:JMXEnv@245] - expect:StandaloneServer_port
    [junit] 2017-02-04 08:25:58,356 [myid:] - INFO  [main:JMXEnv@249] - found:StandaloneServer_port
org.apache.ZooKeeperService:name0=StandaloneServer_port11222
    [junit] 2017-02-04 08:25:58,356 [myid:] - INFO  [main:JUnit4ZKTestRunner$LoggedInvokeMethod@82]
- Memory used 17908
    [junit] 2017-02-04 08:25:58,356 [myid:] - INFO  [main:JUnit4ZKTestRunner$LoggedInvokeMethod@87]
- Number of threads 24
    [junit] 2017-02-04 08:25:58,357 [myid:] - INFO  [main:JUnit4ZKTestRunner$LoggedInvokeMethod@102]
- FINISHED TEST METHOD testQuota
    [junit] 2017-02-04 08:25:58,357 [myid:] - INFO  [main:ClientBase@558] - tearDown starting
    [junit] 2017-02-04 08:25:58,432 [myid:] - INFO  [main:ZooKeeper@1324] - Session: 0x1268533eeb20000
closed
    [junit] 2017-02-04 08:25:58,432 [myid:] - INFO  [main-EventThread:ClientCnxn$EventThread@513]
- EventThread shut down for session: 0x1268533eeb20000
    [junit] 2017-02-04 08:25:58,432 [myid:] - INFO  [main:ClientBase@528] - STOPPING server
    [junit] 2017-02-04 08:25:58,432 [myid:] - INFO  [ConnnectionExpirer:NIOServerCnxnFactory$ConnectionExpirerThread@583]
- ConnnectionExpirerThread interrupted
    [junit] 2017-02-04 08:25:58,432 [myid:] - INFO  [NIOServerCxnFactory.SelectorThread-1:NIOServerCnxnFactory$SelectorThread@420]
- selector thread exitted run method
    [junit] 2017-02-04 08:25:58,432 [myid:] - INFO  [NIOServerCxnFactory.AcceptThread:0.0.0.0/0.0.0.0:11222:NIOServerCnxnFactory$AcceptThread@219]
- accept thread exitted run method
    [junit] 2017-02-04 08:25:58,432 [myid:] - INFO  [NIOServerCxnFactory.SelectorThread-0:NIOServerCnxnFactory$SelectorThread@420]
- selector thread exitted run method
    [junit] 2017-02-04 08:25:58,433 [myid:] - INFO  [main:ZooKeeperServer@534] - shutting
down
    [junit] 2017-02-04 08:25:58,433 [myid:] - ERROR [main:ZooKeeperServer@506] - ZKShutdownHandler
is not registered, so ZooKeeper server won't take any action on ERROR or SHUTDOWN server state
changes
    [junit] 2017-02-04 08:25:58,433 [myid:] - INFO  [main:SessionTrackerImpl@232] - Shutting
down
    [junit] 2017-02-04 08:25:58,433 [myid:] - INFO  [main:PrepRequestProcessor@1009] - Shutting
down
    [junit] 2017-02-04 08:25:58,433 [myid:] - INFO  [main:SyncRequestProcessor@191] - Shutting
down
    [junit] 2017-02-04 08:25:58,433 [myid:] - INFO  [ProcessThread(sid:0 cport:11222)::PrepRequestProcessor@157]
- PrepRequestProcessor exited loop!
    [junit] 2017-02-04 08:25:58,434 [myid:] - INFO  [SyncThread:0:SyncRequestProcessor@169]
- SyncRequestProcessor exited!
    [junit] 2017-02-04 08:25:58,434 [myid:] - INFO  [main:FinalRequestProcessor@481] - shutdown
of request processor complete
    [junit] 2017-02-04 08:25:58,434 [myid:] - INFO  [main:MBeanRegistry@128] - Unregister
MBean [org.apache.ZooKeeperService:name0=StandaloneServer_port11222,name1=InMemoryDataTree]
    [junit] 2017-02-04 08:25:58,434 [myid:] - INFO  [main:MBeanRegistry@128] - Unregister
MBean [org.apache.ZooKeeperService:name0=StandaloneServer_port11222]
    [junit] 2017-02-04 08:25:58,435 [myid:] - INFO  [main:FourLetterWordMain@85] - connecting
to 127.0.0.1 11222
    [junit] 2017-02-04 08:25:58,435 [myid:] - INFO  [main:JMXEnv@146] - ensureOnly:[]
    [junit] 2017-02-04 08:25:58,439 [myid:] - INFO  [main:ClientBase@583] - fdcount after
test is: 60 at start it was 43
    [junit] 2017-02-04 08:25:58,439 [myid:] - INFO  [main:ClientBase@585] - sleeping for 20
secs
    [junit] 2017-02-04 08:25:58,440 [myid:] - INFO  [main:ZKTestCase$1@65] - SUCCEEDED testQuota
    [junit] 2017-02-04 08:25:58,440 [myid:] - INFO  [main:ZKTestCase$1@60] - FINISHED testQuota
    [junit] Tests run: 1, Failures: 0, Errors: 0, Time elapsed: 2.558 sec

BUILD FAILED
/zonestorage/hudson_solaris/home/hudson/hudson-slave/workspace/ZooKeeper-trunk-solaris/build.xml:1237:
Tests failed!

Total time: 69 minutes 4 seconds
Build step 'Invoke Ant' marked build as failure
[locks-and-latches] Releasing all the locks
[locks-and-latches] All the locks released
Recording test results
Email was triggered for: Failure - Any
Sending email for trigger: Failure - Any



###################################################################################
############################## FAILED TESTS (if any) ##############################
3 tests failed.
FAILED:  org.apache.zookeeper.test.LETest.testLE

Error Message:
Threads didn't join

Stack Trace:
junit.framework.AssertionFailedError: Threads didn't join
	at org.apache.zookeeper.test.LETest.testLE(LETest.java:123)
	at org.apache.zookeeper.JUnit4ZKTestRunner$LoggedInvokeMethod.evaluate(JUnit4ZKTestRunner.java:79)


FAILED:  org.apache.zookeeper.test.ReconfigTest.testPortChangeToBlockedPortLeader

Error Message:
client could not connect to reestablished quorum: giving up after 30+ seconds.

Stack Trace:
junit.framework.AssertionFailedError: client could not connect to reestablished quorum: giving
up after 30+ seconds.
	at org.apache.zookeeper.test.ReconfigTest.testNormalOperation(ReconfigTest.java:183)
	at org.apache.zookeeper.test.ReconfigTest.testPortChangeToBlockedPort(ReconfigTest.java:796)
	at org.apache.zookeeper.test.ReconfigTest.testPortChangeToBlockedPortLeader(ReconfigTest.java:719)
	at org.apache.zookeeper.JUnit4ZKTestRunner$LoggedInvokeMethod.evaluate(JUnit4ZKTestRunner.java:79)


FAILED:  org.apache.zookeeper.test.ReconfigTest.testPortChangeToBlockedPortFollower

Error Message:
client could not connect to reestablished quorum: giving up after 30+ seconds.

Stack Trace:
junit.framework.AssertionFailedError: client could not connect to reestablished quorum: giving
up after 30+ seconds.
	at org.apache.zookeeper.test.ReconfigTest.testNormalOperation(ReconfigTest.java:183)
	at org.apache.zookeeper.test.ReconfigTest.testPortChangeToBlockedPort(ReconfigTest.java:796)
	at org.apache.zookeeper.test.ReconfigTest.testPortChangeToBlockedPortFollower(ReconfigTest.java:715)
	at org.apache.zookeeper.JUnit4ZKTestRunner$LoggedInvokeMethod.evaluate(JUnit4ZKTestRunner.java:79)



Mime
  • Unnamed multipart/mixed (inline, None, 0 bytes)
View raw message