zookeeper-dev mailing list archives

Site index · List index
Message view « Date » · « Thread »
Top « Date » · « Thread »
From Apache Jenkins Server <jenk...@builds.apache.org>
Subject ZooKeeper_branch34_jdk7 - Build # 1406 - Still Failing
Date Tue, 14 Feb 2017 18:42:06 GMT
See https://builds.apache.org/job/ZooKeeper_branch34_jdk7/1406/

###################################################################################
########################## LAST 60 LINES OF THE CONSOLE ###########################
[...truncated 243035 lines...]
    [junit] 2017-02-14 18:42:01,352 [myid:] - INFO  [main:SessionTrackerImpl@225] - Shutting
down
    [junit] 2017-02-14 18:42:01,353 [myid:] - INFO  [main:PrepRequestProcessor@764] - Shutting
down
    [junit] 2017-02-14 18:42:01,353 [myid:] - INFO  [main:SyncRequestProcessor@208] - Shutting
down
    [junit] 2017-02-14 18:42:01,353 [myid:] - INFO  [ProcessThread(sid:0 cport:11221)::PrepRequestProcessor@143]
- PrepRequestProcessor exited loop!
    [junit] 2017-02-14 18:42:01,354 [myid:] - INFO  [SyncThread:0:SyncRequestProcessor@186]
- SyncRequestProcessor exited!
    [junit] 2017-02-14 18:42:01,354 [myid:] - INFO  [main:FinalRequestProcessor@402] - shutdown
of request processor complete
    [junit] 2017-02-14 18:42:01,354 [myid:] - INFO  [main:FourLetterWordMain@62] - connecting
to 127.0.0.1 11221
    [junit] 2017-02-14 18:42:01,355 [myid:] - INFO  [main:JMXEnv@147] - ensureOnly:[]
    [junit] 2017-02-14 18:42:01,357 [myid:] - INFO  [main:ClientBase@445] - STARTING server
    [junit] 2017-02-14 18:42:01,357 [myid:] - INFO  [main:ClientBase@366] - CREATING server
instance 127.0.0.1:11221
    [junit] 2017-02-14 18:42:01,358 [myid:] - INFO  [main:NIOServerCnxnFactory@89] - binding
to port 0.0.0.0/0.0.0.0:11221
    [junit] 2017-02-14 18:42:01,358 [myid:] - INFO  [main:ClientBase@341] - STARTING server
instance 127.0.0.1:11221
    [junit] 2017-02-14 18:42:01,358 [myid:] - INFO  [main:ZooKeeperServer@173] - Created server
with tickTime 3000 minSessionTimeout 6000 maxSessionTimeout 60000 datadir /home/jenkins/jenkins-slave/workspace/ZooKeeper_branch34_jdk7/build/test/tmp/test8791374394843758832.junit.dir/version-2
snapdir /home/jenkins/jenkins-slave/workspace/ZooKeeper_branch34_jdk7/build/test/tmp/test8791374394843758832.junit.dir/version-2
    [junit] 2017-02-14 18:42:01,363 [myid:] - ERROR [main:ZooKeeperServer@472] - ZKShutdownHandler
is not registered, so ZooKeeper server won't take any action on ERROR or SHUTDOWN server state
changes
    [junit] 2017-02-14 18:42:01,364 [myid:] - INFO  [main:FourLetterWordMain@62] - connecting
to 127.0.0.1 11221
    [junit] 2017-02-14 18:42:01,364 [myid:] - INFO  [NIOServerCxn.Factory:0.0.0.0/0.0.0.0:11221:NIOServerCnxnFactory@192]
- Accepted socket connection from /127.0.0.1:54614
    [junit] 2017-02-14 18:42:01,365 [myid:] - INFO  [NIOServerCxn.Factory:0.0.0.0/0.0.0.0:11221:NIOServerCnxn@838]
- Processing stat command from /127.0.0.1:54614
    [junit] 2017-02-14 18:42:01,365 [myid:] - INFO  [Thread-4:NIOServerCnxn$StatCommand@674]
- Stat command output
    [junit] 2017-02-14 18:42:01,366 [myid:] - INFO  [Thread-4:NIOServerCnxn@1019] - Closed
socket connection for client /127.0.0.1:54614 (no session established for client)
    [junit] 2017-02-14 18:42:01,366 [myid:] - INFO  [main:JMXEnv@230] - ensureParent:[InMemoryDataTree,
StandaloneServer_port]
    [junit] 2017-02-14 18:42:01,368 [myid:] - INFO  [main:JMXEnv@247] - expect:InMemoryDataTree
    [junit] 2017-02-14 18:42:01,368 [myid:] - INFO  [main:JMXEnv@251] - found:InMemoryDataTree
org.apache.ZooKeeperService:name0=StandaloneServer_port11221,name1=InMemoryDataTree
    [junit] 2017-02-14 18:42:01,369 [myid:] - INFO  [main:JMXEnv@247] - expect:StandaloneServer_port
    [junit] 2017-02-14 18:42:01,369 [myid:] - INFO  [main:JMXEnv@251] - found:StandaloneServer_port
org.apache.ZooKeeperService:name0=StandaloneServer_port11221
    [junit] 2017-02-14 18:42:01,369 [myid:] - INFO  [main:JUnit4ZKTestRunner$LoggedInvokeMethod@58]
- Memory used 35674
    [junit] 2017-02-14 18:42:01,369 [myid:] - INFO  [main:JUnit4ZKTestRunner$LoggedInvokeMethod@63]
- Number of threads 20
    [junit] 2017-02-14 18:42:01,369 [myid:] - INFO  [main:JUnit4ZKTestRunner$LoggedInvokeMethod@78]
- FINISHED TEST METHOD testQuota
    [junit] 2017-02-14 18:42:01,370 [myid:] - INFO  [main:ClientBase@522] - tearDown starting
    [junit] 2017-02-14 18:42:01,434 [myid:] - INFO  [main:ZooKeeper@684] - Session: 0x15a3dee716f0000
closed
    [junit] 2017-02-14 18:42:01,434 [myid:] - INFO  [main:ClientBase@492] - STOPPING server
    [junit] 2017-02-14 18:42:01,435 [myid:] - INFO  [main-EventThread:ClientCnxn$EventThread@519]
- EventThread shut down for session: 0x15a3dee716f0000
    [junit] 2017-02-14 18:42:01,435 [myid:] - INFO  [NIOServerCxn.Factory:0.0.0.0/0.0.0.0:11221:NIOServerCnxnFactory@219]
- NIOServerCnxn factory exited run method
    [junit] 2017-02-14 18:42:01,435 [myid:] - INFO  [main:ZooKeeperServer@505] - shutting
down
    [junit] 2017-02-14 18:42:01,435 [myid:] - ERROR [main:ZooKeeperServer@472] - ZKShutdownHandler
is not registered, so ZooKeeper server won't take any action on ERROR or SHUTDOWN server state
changes
    [junit] 2017-02-14 18:42:01,436 [myid:] - INFO  [main:SessionTrackerImpl@225] - Shutting
down
    [junit] 2017-02-14 18:42:01,436 [myid:] - INFO  [main:PrepRequestProcessor@764] - Shutting
down
    [junit] 2017-02-14 18:42:01,436 [myid:] - INFO  [main:SyncRequestProcessor@208] - Shutting
down
    [junit] 2017-02-14 18:42:01,436 [myid:] - INFO  [ProcessThread(sid:0 cport:11221)::PrepRequestProcessor@143]
- PrepRequestProcessor exited loop!
    [junit] 2017-02-14 18:42:01,436 [myid:] - INFO  [SyncThread:0:SyncRequestProcessor@186]
- SyncRequestProcessor exited!
    [junit] 2017-02-14 18:42:01,437 [myid:] - INFO  [main:FinalRequestProcessor@402] - shutdown
of request processor complete
    [junit] 2017-02-14 18:42:01,437 [myid:] - INFO  [main:FourLetterWordMain@62] - connecting
to 127.0.0.1 11221
    [junit] 2017-02-14 18:42:01,438 [myid:] - INFO  [main:JMXEnv@147] - ensureOnly:[]
    [junit] 2017-02-14 18:42:01,442 [myid:] - INFO  [main:ClientBase@547] - fdcount after
test is: 90 at start it was 78
    [junit] 2017-02-14 18:42:01,443 [myid:] - INFO  [main:ClientBase@549] - sleeping for 20
secs
    [junit] 2017-02-14 18:42:01,444 [myid:] - INFO  [main:ZKTestCase$1@65] - SUCCEEDED testQuota
    [junit] 2017-02-14 18:42:01,444 [myid:] - INFO  [main:ZKTestCase$1@60] - FINISHED testQuota
    [junit] Tests run: 1, Failures: 0, Errors: 0, Skipped: 0, Time elapsed: 0.55 sec

fail.build.on.test.failure:

BUILD FAILED
/home/jenkins/jenkins-slave/workspace/ZooKeeper_branch34_jdk7/build.xml:1328: The following
error occurred while executing this line:
/home/jenkins/jenkins-slave/workspace/ZooKeeper_branch34_jdk7/build.xml:1331: Tests failed!

Total time: 29 minutes 7 seconds
Build step 'Invoke Ant' marked build as failure
Recording test results
Email was triggered for: Failure - Any
Sending email for trigger: Failure - Any



###################################################################################
############################## FAILED TESTS (if any) ##############################
2 tests failed.
FAILED:  org.apache.zookeeper.server.quorum.auth.QuorumKerberosHostBasedAuthTest.testValidCredentials

Error Message:
waiting for server 0 being up

Stack Trace:
junit.framework.AssertionFailedError: waiting for server 0 being up
	at org.apache.zookeeper.server.quorum.auth.QuorumAuthTestBase.startQuorum(QuorumAuthTestBase.java:74)
	at org.apache.zookeeper.server.quorum.auth.QuorumKerberosHostBasedAuthTest.testValidCredentials(QuorumKerberosHostBasedAuthTest.java:125)
	at org.apache.zookeeper.JUnit4ZKTestRunner$LoggedInvokeMethod.evaluate(JUnit4ZKTestRunner.java:55)


FAILED:  org.apache.zookeeper.server.quorum.auth.QuorumKerberosHostBasedAuthTest.testConnectBadServer

Error Message:
waiting for server 0 being up

Stack Trace:
junit.framework.AssertionFailedError: waiting for server 0 being up
	at org.apache.zookeeper.server.quorum.auth.QuorumAuthTestBase.startQuorum(QuorumAuthTestBase.java:74)
	at org.apache.zookeeper.server.quorum.auth.QuorumKerberosHostBasedAuthTest.testConnectBadServer(QuorumKerberosHostBasedAuthTest.java:146)
	at org.apache.zookeeper.JUnit4ZKTestRunner$LoggedInvokeMethod.evaluate(JUnit4ZKTestRunner.java:55)



Mime
  • Unnamed multipart/mixed (inline, None, 0 bytes)
View raw message