zookeeper-dev mailing list archives

Site index · List index
Message view « Date » · « Thread »
Top « Date » · « Thread »
From Apache Jenkins Server <jenk...@builds.apache.org>
Subject Failed: ZOOKEEPER- PreCommit Build #364
Date Tue, 21 Feb 2017 17:56:07 GMT
Build: https://builds.apache.org/job/PreCommit-ZOOKEEPER-github-pr-build/364/

###################################################################################
########################## LAST 60 LINES OF THE CONSOLE ###########################
[...truncated 68.42 MB...]
     [exec] 
     [exec]     +1 javadoc.  The javadoc tool did not generate any warning messages.
     [exec] 
     [exec]     +1 javac.  The applied patch does not increase the total number of javac compiler
warnings.
     [exec] 
     [exec]     -1 findbugs.  The patch appears to introduce 1 new Findbugs (version 3.0.1)
warnings.
     [exec] 
     [exec]     +1 release audit.  The applied patch does not increase the total number of
release audit warnings.
     [exec] 
     [exec]     -1 core tests.  The patch failed core unit tests.
     [exec] 
     [exec]     +1 contrib tests.  The patch passed contrib unit tests.
     [exec] 
     [exec] Test results: https://builds.apache.org/job/PreCommit-ZOOKEEPER-github-pr-build/364//testReport/
     [exec] Findbugs warnings: https://builds.apache.org/job/PreCommit-ZOOKEEPER-github-pr-build/364//artifact/trunk/build/test/findbugs/newPatchFindbugsWarnings.html
     [exec] Console output: https://builds.apache.org/job/PreCommit-ZOOKEEPER-github-pr-build/364//console
     [exec] 
     [exec] This message is automatically generated.
     [exec] 
     [exec] 
     [exec] ======================================================================
     [exec] ======================================================================
     [exec]     Adding comment to Jira.
     [exec] ======================================================================
     [exec] ======================================================================
     [exec] 
     [exec] 
     [exec] Comment added.
     [exec] 8ee079f343ffff1887016af11c5bbaa71cc594e7 logged out
     [exec] 
     [exec] 
     [exec] ======================================================================
     [exec] ======================================================================
     [exec]     Finished build.
     [exec] ======================================================================
     [exec] ======================================================================
     [exec] 
     [exec] 
     [exec] mv: '/home/jenkins/jenkins-slave/workspace/PreCommit-ZOOKEEPER-github-pr-build/patchprocess'
and '/home/jenkins/jenkins-slave/workspace/PreCommit-ZOOKEEPER-github-pr-build/patchprocess'
are the same file

BUILD FAILED
/home/jenkins/jenkins-slave/workspace/PreCommit-ZOOKEEPER-github-pr-build/build.xml:1635:
exec returned: 2

Total time: 13 minutes 15 seconds
Build step 'Execute shell' marked build as failure
Archiving artifacts
Setting JDK_1_7_LATEST__HOME=/home/jenkins/tools/java/latest1.7
Compressed 579.49 KB of artifacts by 49.7% relative to #362
Recording test results
Setting JDK_1_7_LATEST__HOME=/home/jenkins/tools/java/latest1.7
Setting JDK_1_7_LATEST__HOME=/home/jenkins/tools/java/latest1.7
[description-setter] Description set: ZOOKEEPER-2700
Putting comment on the pull request
Setting JDK_1_7_LATEST__HOME=/home/jenkins/tools/java/latest1.7
Email was triggered for: Failure - Any
Sending email for trigger: Failure - Any
Setting JDK_1_7_LATEST__HOME=/home/jenkins/tools/java/latest1.7
Setting JDK_1_7_LATEST__HOME=/home/jenkins/tools/java/latest1.7
Setting JDK_1_7_LATEST__HOME=/home/jenkins/tools/java/latest1.7



###################################################################################
############################## FAILED TESTS (if any) ##############################
4 tests failed.
FAILED:  org.apache.zookeeper.server.quorum.Zab1_0Test.testNormalFollowerRunWithDiff

Error Message:

followerZooKeeperServer.takeSnapshot();
Never wanted here:
-> at org.apache.zookeeper.server.quorum.Zab1_0Test$5.converseWithFollower(Zab1_0Test.java:883)
But invoked here:
-> at org.apache.zookeeper.server.SyncRequestProcessor$1.run(SyncRequestProcessor.java:134)


Stack Trace:
junit.framework.AssertionFailedError: 
followerZooKeeperServer.takeSnapshot();
Never wanted here:
-> at org.apache.zookeeper.server.quorum.Zab1_0Test$5.converseWithFollower(Zab1_0Test.java:883)
But invoked here:
-> at org.apache.zookeeper.server.SyncRequestProcessor$1.run(SyncRequestProcessor.java:134)

	at org.apache.zookeeper.server.quorum.Zab1_0Test$5.converseWithFollower(Zab1_0Test.java:883)
	at org.apache.zookeeper.server.quorum.Zab1_0Test.testFollowerConversation(Zab1_0Test.java:517)
	at org.apache.zookeeper.server.quorum.Zab1_0Test.testNormalFollowerRunWithDiff(Zab1_0Test.java:784)
	at org.apache.zookeeper.JUnit4ZKTestRunner$LoggedInvokeMethod.evaluate(JUnit4ZKTestRunner.java:79)


FAILED:  org.apache.zookeeper.test.FollowerResyncConcurrencyTest.testResyncByTxnlogThenDiffAfterFollowerCrashes

Error Message:
Should have same number of ephemerals in both followers expected:<108> but was:<120>

Stack Trace:
junit.framework.AssertionFailedError: Should have same number of ephemerals in both followers
expected:<108> but was:<120>
	at org.apache.zookeeper.test.FollowerResyncConcurrencyTest.verifyState(FollowerResyncConcurrencyTest.java:661)
	at org.apache.zookeeper.test.FollowerResyncConcurrencyTest.followerResyncCrashTest(FollowerResyncConcurrencyTest.java:355)
	at org.apache.zookeeper.test.FollowerResyncConcurrencyTest.testResyncByTxnlogThenDiffAfterFollowerCrashes(FollowerResyncConcurrencyTest.java:191)
	at org.apache.zookeeper.JUnit4ZKTestRunner$LoggedInvokeMethod.evaluate(JUnit4ZKTestRunner.java:79)


FAILED:  org.apache.zookeeper.test.FollowerResyncConcurrencyTest.testResyncByDiffAfterFollowerCrashes

Error Message:
Should have same number of ephemerals in both followers expected:<2301> but was:<2400>

Stack Trace:
junit.framework.AssertionFailedError: Should have same number of ephemerals in both followers
expected:<2301> but was:<2400>
	at org.apache.zookeeper.test.FollowerResyncConcurrencyTest.verifyState(FollowerResyncConcurrencyTest.java:661)
	at org.apache.zookeeper.test.FollowerResyncConcurrencyTest.testResyncByDiffAfterFollowerCrashes(FollowerResyncConcurrencyTest.java:531)
	at org.apache.zookeeper.JUnit4ZKTestRunner$LoggedInvokeMethod.evaluate(JUnit4ZKTestRunner.java:79)


FAILED:  org.apache.zookeeper.test.ReadOnlyModeTest.testSessionEstablishment

Error Message:
KeeperErrorCode = ConnectionLoss for /test

Stack Trace:
org.apache.zookeeper.KeeperException$ConnectionLossException: KeeperErrorCode = ConnectionLoss
for /test
	at org.apache.zookeeper.KeeperException.create(KeeperException.java:99)
	at org.apache.zookeeper.KeeperException.create(KeeperException.java:51)
	at org.apache.zookeeper.ZooKeeper.create(ZooKeeper.java:1424)
	at org.apache.zookeeper.test.ReadOnlyModeTest.testSessionEstablishment(ReadOnlyModeTest.java:238)
	at org.apache.zookeeper.JUnit4ZKTestRunner$LoggedInvokeMethod.evaluate(JUnit4ZKTestRunner.java:79)
	at java.util.concurrent.FutureTask.run(FutureTask.java:262)
	at java.lang.Thread.run(Thread.java:745)



Mime
  • Unnamed multipart/mixed (inline, None, 0 bytes)
View raw message