zookeeper-dev mailing list archives

Site index · List index
Message view « Date » · « Thread »
Top « Date » · « Thread »
From Apache Jenkins Server <jenk...@builds.apache.org>
Subject ZooKeeper_branch35_solaris - Build # 438 - Still Failing
Date Tue, 14 Feb 2017 16:14:37 GMT
See https://builds.apache.org/job/ZooKeeper_branch35_solaris/438/

###################################################################################
########################## LAST 60 LINES OF THE CONSOLE ###########################
[...truncated 278 lines...]
    [junit] 2017-02-14 16:15:19,308 [myid:] - INFO  [main:JUnit4ZKTestRunner$LoggedInvokeMethod@82]
- Memory used 6264
    [junit] 2017-02-14 16:15:19,309 [myid:] - INFO  [main:JUnit4ZKTestRunner$LoggedInvokeMethod@87]
- Number of threads 5
    [junit] 2017-02-14 16:15:19,309 [myid:] - INFO  [main:JUnit4ZKTestRunner$LoggedInvokeMethod@102]
- FINISHED TEST METHOD testClientReconnect
    [junit] 2017-02-14 16:15:19,309 [myid:] - INFO  [main:ZKTestCase$1@65] - SUCCEEDED testClientReconnect
    [junit] 2017-02-14 16:15:19,309 [myid:] - INFO  [main:ZKTestCase$1@60] - FINISHED testClientReconnect
    [junit] Tests run: 1, Failures: 0, Errors: 0, Time elapsed: 9.863 sec
    [junit] 2017-02-14 16:15:39,228 [myid:] - INFO  [main:JUnit4ZKTestRunner@47] - No test.method
specified. using default methods.
    [junit] Running org.apache.zookeeper.CustomHostProviderTest
    [junit] 2017-02-14 16:15:39,963 [myid:] - INFO  [main:JUnit4ZKTestRunner@47] - No test.method
specified. using default methods.
    [junit] 2017-02-14 16:15:40,679 [myid:] - INFO  [main:ZKTestCase$1@55] - STARTING testZooKeeperWithCustomHostProvider
    [junit] 2017-02-14 16:15:40,682 [myid:] - INFO  [main:JUnit4ZKTestRunner$LoggedInvokeMethod@77]
- RUNNING TEST METHOD testZooKeeperWithCustomHostProvider
    [junit] 2017-02-14 16:15:40,720 [myid:] - INFO  [main:PortAssignment@157] - Single test
process using ports from 11221 - 32767.
    [junit] 2017-02-14 16:15:40,812 [myid:] - INFO  [main:PortAssignment@85] - Assigned port
11222 from range 11221 - 32767.
    [junit] 2017-02-14 16:15:40,954 [myid:] - INFO  [main:Environment@109] - Client environment:zookeeper.version=3.5.3-alpha-SNAPSHOT--1,
built on 02/14/2017 16:12 GMT
    [junit] 2017-02-14 16:15:40,954 [myid:] - INFO  [main:Environment@109] - Client environment:host.name=hudson-solaris
    [junit] 2017-02-14 16:15:40,955 [myid:] - INFO  [main:Environment@109] - Client environment:java.version=1.7.0_79
    [junit] 2017-02-14 16:15:40,955 [myid:] - INFO  [main:Environment@109] - Client environment:java.vendor=Oracle
Corporation
    [junit] 2017-02-14 16:15:40,955 [myid:] - INFO  [main:Environment@109] - Client environment:java.home=/zonestorage/hudson_solaris/home/hudson/tools/java/jdk1.7.0_79/jre
    [junit] 2017-02-14 16:15:40,955 [myid:] - INFO  [main:Environment@109] - Client environment:java.class.path=/zonestorage/hudson_solaris/home/hudson/hudson-slave/workspace/ZooKeeper_branch35_solaris/build/test/classes:/zonestorage/hudson_solaris/home/hudson/hudson-slave/workspace/ZooKeeper_branch35_solaris/build/test/lib/antlr-2.7.7.jar:/zonestorage/hudson_solaris/home/hudson/hudson-slave/workspace/ZooKeeper_branch35_solaris/build/test/lib/antlr4-runtime-4.5.1-1.jar:/zonestorage/hudson_solaris/home/hudson/hudson-slave/workspace/ZooKeeper_branch35_solaris/build/test/lib/checkstyle-6.13.jar:/zonestorage/hudson_solaris/home/hudson/hudson-slave/workspace/ZooKeeper_branch35_solaris/build/test/lib/commons-beanutils-1.9.2.jar:/zonestorage/hudson_solaris/home/hudson/hudson-slave/workspace/ZooKeeper_branch35_solaris/build/test/lib/commons-cli-1.3.1.jar:/zonestorage/hudson_solaris/home/hudson/hudson-slave/workspace/ZooKeeper_branch35_solaris/build/test/lib/commons-collections-3.2.2.jar:/zonestorage/hudson_solaris/home/hudson/hudson-slave/workspace/ZooKeeper_branch35_solaris/build/test/lib/commons-lang3-3.4.jar:/zonestorage/hudson_solaris/home/hudson/hudson-slave/workspace/ZooKeeper_branch35_solaris/build/test/lib/commons-logging-1.1.1.jar:/zonestorage/hudson_solaris/home/hudson/hudson-slave/workspace/ZooKeeper_branch35_solaris/build/test/lib/guava-18.0.jar:/zonestorage/hudson_solaris/home/hudson/hudson-slave/workspace/ZooKeeper_branch35_solaris/build/test/lib/hamcrest-core-1.3.jar:/zonestorage/hudson_solaris/home/hudson/hudson-slave/workspace/ZooKeeper_branch35_solaris/build/test/lib/junit-4.12.jar:/zonestorage/hudson_solaris/home/hudson/hudson-slave/workspace/ZooKeeper_branch35_solaris/build/test/lib/mockito-all-1.8.2.jar:/zonestorage/hudson_solaris/home/hudson/hudson-slave/workspace/ZooKeeper_branch35_solaris/build/classes:/zonestorage/hudson_solaris/home/hudson/hudson-slave/workspace/ZooKeeper_branch35_solaris/src/java/lib/ivy-2.4.0.jar:/home/jenkins/tools/ant/latest/lib/ant.jar:/zonestorage/hudson_solaris/home/hudson/hudson-slave/workspace/ZooKeeper_branch35_solaris/build/lib/commons-cli-1.2.jar:/zonestorage/hudson_solaris/home/hudson/hudson-slave/workspace/ZooKeeper_branch35_solaris/build/lib/jackson-core-asl-1.9.11.jar:/zonestorage/hudson_solaris/home/hudson/hudson-slave/workspace/ZooKeeper_branch35_solaris/build/lib/jackson-mapper-asl-1.9.11.jar:/zonestorage/hudson_solaris/home/hudson/hudson-slave/workspace/ZooKeeper_branch35_solaris/build/lib/javacc.jar:/zonestorage/hudson_solaris/home/hudson/hudson-slave/workspace/ZooKeeper_branch35_solaris/build/lib/javax.servlet-api-3.1.0.jar:/zonestorage/hudson_solaris/home/hudson/hudson-slave/workspace/ZooKeeper_branch35_solaris/build/lib/jetty-http-9.2.18.v20160721.jar:/zonestorage/hudson_solaris/home/hudson/hudson-slave/workspace/ZooKeeper_branch35_solaris/build/lib/jetty-io-9.2.18.v20160721.jar:/zonestorage/hudson_solaris/home/hudson/hudson-slave/workspace/ZooKeeper_branch35_solaris/build/lib/jetty-security-9.2.18.v20160721.jar:/zonestorage/hudson_solaris/home/hudson/hudson-slave/workspace/ZooKeeper_branch35_solaris/build/lib/jetty-server-9.2.18.v20160721.jar:/zonestorage/hudson_solaris/home/hudson/hudson-slave/workspace/ZooKeeper_branch35_solaris/build/lib/jetty-servlet-9.2.18.v20160721.jar:/zonestorage/hudson_solaris/home/hudson/hudson-slave/workspace/ZooKeeper_branch35_solaris/build/lib/jetty-util-9.2.18.v20160721.jar:/zonestorage/hudson_solaris/home/hudson/hudson-slave/workspace/ZooKeeper_branch35_solaris/build/lib/jline-2.11.jar:/zonestorage/hudson_solaris/home/hudson/hudson-slave/workspace/ZooKeeper_branch35_solaris/build/lib/log4j-1.2.17.jar:/zonestorage/hudson_solaris/home/hudson/hudson-slave/workspace/ZooKeeper_branch35_solaris/build/lib/netty-3.10.5.Final.jar:/zonestorage/hudson_solaris/home/hudson/hudson-slave/workspace/ZooKeeper_branch35_solaris/build/lib/slf4j-api-1.7.5.jar:/zonestorage/hudson_solaris/home/hudson/hudson-slave/workspace/ZooKeeper_branch35_solaris/build/lib/slf4j-log4j12-1.7.5.jar:/zonestorage/hudson_solaris/home/hudson/tools/ant/apache-ant-1.8.2/lib/ant-launcher.jar:/home/jenkins/tools/ant/latest/lib/ant-junit.jar:/home/jenkins/tools/ant/latest/lib/ant-junit4.jar
    [junit] 2017-02-14 16:15:40,956 [myid:] - INFO  [main:Environment@109] - Client environment:java.library.path=/usr/jdk/packages/lib/i386:/lib:/usr/lib
    [junit] 2017-02-14 16:15:40,956 [myid:] - INFO  [main:Environment@109] - Client environment:java.io.tmpdir=/var/tmp/
    [junit] 2017-02-14 16:15:40,956 [myid:] - INFO  [main:Environment@109] - Client environment:java.compiler=<NA>
    [junit] 2017-02-14 16:15:40,956 [myid:] - INFO  [main:Environment@109] - Client environment:os.name=SunOS
    [junit] 2017-02-14 16:15:40,958 [myid:] - INFO  [main:Environment@109] - Client environment:os.arch=x86
    [junit] 2017-02-14 16:15:40,958 [myid:] - INFO  [main:Environment@109] - Client environment:os.version=5.10
    [junit] 2017-02-14 16:15:40,958 [myid:] - INFO  [main:Environment@109] - Client environment:user.name=hudson
    [junit] 2017-02-14 16:15:40,959 [myid:] - INFO  [main:Environment@109] - Client environment:user.home=/export/home/hudson
    [junit] 2017-02-14 16:15:40,959 [myid:] - INFO  [main:Environment@109] - Client environment:user.dir=/zonestorage/hudson_solaris/home/hudson/hudson-slave/workspace/ZooKeeper_branch35_solaris/build/test
    [junit] 2017-02-14 16:15:40,959 [myid:] - INFO  [main:Environment@109] - Client environment:os.memory.free=51MB
    [junit] 2017-02-14 16:15:40,959 [myid:] - INFO  [main:Environment@109] - Client environment:os.memory.max=454MB
    [junit] 2017-02-14 16:15:40,959 [myid:] - INFO  [main:Environment@109] - Client environment:os.memory.total=61MB
    [junit] 2017-02-14 16:15:41,158 [myid:] - INFO  [main:ZooKeeper@863] - Initiating client
connection, connectString=127.0.0.1:11222 sessionTimeout=30000 watcher=org.apache.zookeeper.CustomHostProviderTest@16564b8
    [junit] 2017-02-14 16:15:44,253 [myid:] - INFO  [main:ClientCnxnSocket@236] - jute.maxbuffer
value is 4194304 Bytes
    [junit] 2017-02-14 16:15:44,706 [myid:] - INFO  [main:ZooKeeper@863] - Initiating client
connection, connectString=127.0.0.1:11222 sessionTimeout=30000 watcher=org.apache.zookeeper.CustomHostProviderTest@16564b8
    [junit] 2017-02-14 16:15:44,707 [myid:] - INFO  [main:ClientCnxnSocket@236] - jute.maxbuffer
value is 4194304 Bytes
    [junit] 2017-02-14 16:15:44,708 [myid:] - INFO  [main:PortAssignment@85] - Assigned port
11223 from range 11221 - 32767.
    [junit] 2017-02-14 16:15:44,709 [myid:] - INFO  [main:ClientCnxnSocketNIO@378] - testableCloseSocket()
called
    [junit] 2017-02-14 16:15:44,709 [myid:] - INFO  [main:PortAssignment@85] - Assigned port
11224 from range 11221 - 32767.
    [junit] 2017-02-14 16:15:44,709 [myid:] - INFO  [main:JUnit4ZKTestRunner$LoggedInvokeMethod@82]
- Memory used 12275
    [junit] 2017-02-14 16:15:44,709 [myid:] - INFO  [main:JUnit4ZKTestRunner$LoggedInvokeMethod@87]
- Number of threads 8
    [junit] 2017-02-14 16:15:44,709 [myid:] - INFO  [main:JUnit4ZKTestRunner$LoggedInvokeMethod@102]
- FINISHED TEST METHOD testZooKeeperWithCustomHostProvider
    [junit] 2017-02-14 16:15:44,710 [myid:] - INFO  [main:ZKTestCase$1@65] - SUCCEEDED testZooKeeperWithCustomHostProvider
    [junit] 2017-02-14 16:15:44,710 [myid:] - INFO  [main:ZKTestCase$1@60] - FINISHED testZooKeeperWithCustomHostProvider
    [junit] 2017-02-14 16:15:44,955 [myid:127.0.0.1:2181] - INFO  [main-SendThread(127.0.0.1:2181):ClientCnxn$SendThread@1113]
- Opening socket connection to server /127.0.0.1:2181. Will not attempt to authenticate using
SASL (unknown error)
    [junit] 2017-02-14 16:15:44,956 [myid:127.0.0.1:11223] - INFO  [main-SendThread(127.0.0.1:11223):ClientCnxn$SendThread@1113]
- Opening socket connection to server 127.0.0.1/127.0.0.1:11223. Will not attempt to authenticate
using SASL (unknown error)
    [junit] Tests run: 1, Failures: 0, Errors: 0, Time elapsed: 5.578 sec
    [junit] Running org.apache.zookeeper.MultiResponseTest
    [junit] Tests run: 1, Failures: 0, Errors: 1, Time elapsed: 0 sec

BUILD FAILED
/zonestorage/hudson_solaris/home/hudson/hudson-slave/workspace/ZooKeeper_branch35_solaris/build.xml:1227:
Process fork failed.

Total time: 3 minutes 41 seconds
Build step 'Invoke Ant' marked build as failure
[locks-and-latches] Releasing all the locks
[locks-and-latches] All the locks released
Recording test results
Email was triggered for: Failure - Any
Sending email for trigger: Failure - Any



###################################################################################
############################## FAILED TESTS (if any) ##############################
1 tests failed.
FAILED:  org.apache.zookeeper.MultiResponseTest.unknown

Error Message:
Forked Java VM exited abnormally. Please note the time in the report does not reflect the
time until the VM exit.

Stack Trace:
junit.framework.AssertionFailedError: Forked Java VM exited abnormally. Please note the time
in the report does not reflect the time until the VM exit.



Mime
  • Unnamed multipart/mixed (inline, None, 0 bytes)
View raw message