zookeeper-dev mailing list archives

Site index · List index
Message view « Date » · « Thread »
Top « Date » · « Thread »
From Apache Jenkins Server <jenk...@builds.apache.org>
Subject ZooKeeper_branch35_jdk8 - Build # 402 - Still Failing
Date Sat, 04 Feb 2017 12:21:10 GMT
See https://builds.apache.org/job/ZooKeeper_branch35_jdk8/402/

###################################################################################
########################## LAST 60 LINES OF THE CONSOLE ###########################
[...truncated 558860 lines...]
    [junit] 2017-02-04 12:14:55,560 [myid:127.0.0.1:27485] - WARN  [main-SendThread(127.0.0.1:27485):ClientCnxn$SendThread@1235]
- Session 0x1039c88b6310003 for server 127.0.0.1/127.0.0.1:27485, unexpected error, closing
socket connection and attempting reconnect
    [junit] java.net.ConnectException: Connection refused
    [junit] 	at sun.nio.ch.SocketChannelImpl.checkConnect(Native Method)
    [junit] 	at sun.nio.ch.SocketChannelImpl.finishConnect(SocketChannelImpl.java:717)
    [junit] 	at org.apache.zookeeper.ClientCnxnSocketNIO.doTransport(ClientCnxnSocketNIO.java:357)
    [junit] 	at org.apache.zookeeper.ClientCnxn$SendThread.run(ClientCnxn.java:1214)
    [junit] 2017-02-04 12:14:55,586 [myid:] - INFO  [SessionTracker:SessionTrackerImpl@158]
- SessionTrackerImpl exited loop!
    [junit] 2017-02-04 12:14:55,648 [myid:127.0.0.1:27500] - INFO  [main-SendThread(127.0.0.1:27500):ClientCnxn$SendThread@1113]
- Opening socket connection to server 127.0.0.1/127.0.0.1:27500. Will not attempt to authenticate
using SASL (unknown error)
    [junit] 2017-02-04 12:14:55,648 [myid:127.0.0.1:27500] - WARN  [main-SendThread(127.0.0.1:27500):ClientCnxn$SendThread@1235]
- Session 0x1039c8abaaf0000 for server 127.0.0.1/127.0.0.1:27500, unexpected error, closing
socket connection and attempting reconnect
    [junit] java.net.ConnectException: Connection refused
    [junit] 	at sun.nio.ch.SocketChannelImpl.checkConnect(Native Method)
    [junit] 	at sun.nio.ch.SocketChannelImpl.finishConnect(SocketChannelImpl.java:717)
    [junit] 	at org.apache.zookeeper.ClientCnxnSocketNIO.doTransport(ClientCnxnSocketNIO.java:357)
    [junit] 	at org.apache.zookeeper.ClientCnxn$SendThread.run(ClientCnxn.java:1214)
    [junit] Test org.apache.zookeeper.test.NioNettySuiteTest FAILED
    [junit] 2017-02-04 12:15:13,019 [myid:] - INFO  [main:JUnit4ZKTestRunner$LoggedInvokeMethod@82]
- Memory used 134190
    [junit] 2017-02-04 12:15:13,020 [myid:] - INFO  [main:JUnit4ZKTestRunner$LoggedInvokeMethod@87]
- Number of threads 55
    [junit] 2017-02-04 12:15:13,020 [myid:] - INFO  [main:JUnit4ZKTestRunner$LoggedInvokeMethod@102]
- FINISHED TEST METHOD testManyChildWatchersAutoReset
    [junit] 2017-02-04 12:15:13,020 [myid:] - INFO  [main:ClientBase@543] - tearDown starting
    [junit] 2017-02-04 12:15:13,021 [myid:] - INFO  [ProcessThread(sid:0 cport:19304)::PrepRequestProcessor@656]
- Processed session termination for sessionid: 0x1039c8215f60000
    [junit] 2017-02-04 12:15:13,027 [myid:] - INFO  [main:ZooKeeper@1322] - Session: 0x1039c8215f60000
closed
    [junit] 2017-02-04 12:15:13,028 [myid:] - INFO  [NIOWorkerThread-5:MBeanRegistry@128]
- Unregister MBean [org.apache.ZooKeeperService:name0=StandaloneServer_port19304,name1=Connections,name2=127.0.0.1,name3=0x1039c8215f60000]
    [junit] 2017-02-04 12:15:13,028 [myid:] - INFO  [main-EventThread:ClientCnxn$EventThread@513]
- EventThread shut down for session: 0x1039c8215f60000
    [junit] 2017-02-04 12:15:13,030 [myid:] - INFO  [NIOWorkerThread-5:NIOServerCnxn@614]
- Closed socket connection for client /127.0.0.1:58339 which had sessionid 0x1039c8215f60000
    [junit] 2017-02-04 12:15:13,030 [myid:] - INFO  [ProcessThread(sid:0 cport:19304)::PrepRequestProcessor@656]
- Processed session termination for sessionid: 0x1039c8215f60001
    [junit] 2017-02-04 12:15:13,036 [myid:] - INFO  [NIOWorkerThread-4:MBeanRegistry@128]
- Unregister MBean [org.apache.ZooKeeperService:name0=StandaloneServer_port19304,name1=Connections,name2=127.0.0.1,name3=0x1039c8215f60001]
    [junit] 2017-02-04 12:15:13,036 [myid:] - INFO  [NIOWorkerThread-4:NIOServerCnxn@614]
- Closed socket connection for client /127.0.0.1:58396 which had sessionid 0x1039c8215f60001
    [junit] 2017-02-04 12:15:13,038 [myid:] - INFO  [main:ZooKeeper@1322] - Session: 0x1039c8215f60001
closed
    [junit] 2017-02-04 12:15:13,038 [myid:] - INFO  [main:ClientBase@513] - STOPPING server
    [junit] 2017-02-04 12:15:13,038 [myid:] - INFO  [main-EventThread:ClientCnxn$EventThread@513]
- EventThread shut down for session: 0x1039c8215f60001
    [junit] 2017-02-04 12:15:13,039 [myid:] - INFO  [NIOServerCxnFactory.AcceptThread:0.0.0.0/0.0.0.0:19304:NIOServerCnxnFactory$AcceptThread@219]
- accept thread exitted run method
    [junit] 2017-02-04 12:15:13,039 [myid:] - INFO  [ConnnectionExpirer:NIOServerCnxnFactory$ConnectionExpirerThread@583]
- ConnnectionExpirerThread interrupted
    [junit] 2017-02-04 12:15:13,045 [myid:] - INFO  [NIOServerCxnFactory.SelectorThread-0:NIOServerCnxnFactory$SelectorThread@420]
- selector thread exitted run method
    [junit] 2017-02-04 12:15:13,046 [myid:] - INFO  [NIOServerCxnFactory.SelectorThread-1:NIOServerCnxnFactory$SelectorThread@420]
- selector thread exitted run method
    [junit] 2017-02-04 12:15:13,046 [myid:] - INFO  [main:ZooKeeperServer@533] - shutting
down
    [junit] 2017-02-04 12:15:13,046 [myid:] - ERROR [main:ZooKeeperServer@505] - ZKShutdownHandler
is not registered, so ZooKeeper server won't take any action on ERROR or SHUTDOWN server state
changes
    [junit] 2017-02-04 12:15:13,046 [myid:] - INFO  [main:SessionTrackerImpl@232] - Shutting
down
    [junit] 2017-02-04 12:15:13,046 [myid:] - INFO  [main:PrepRequestProcessor@974] - Shutting
down
    [junit] 2017-02-04 12:15:13,046 [myid:] - INFO  [main:SyncRequestProcessor@191] - Shutting
down
    [junit] 2017-02-04 12:15:13,046 [myid:] - INFO  [ProcessThread(sid:0 cport:19304)::PrepRequestProcessor@154]
- PrepRequestProcessor exited loop!
    [junit] 2017-02-04 12:15:13,046 [myid:] - INFO  [SyncThread:0:SyncRequestProcessor@169]
- SyncRequestProcessor exited!
    [junit] 2017-02-04 12:15:13,047 [myid:] - INFO  [main:FinalRequestProcessor@479] - shutdown
of request processor complete
    [junit] 2017-02-04 12:15:13,048 [myid:] - INFO  [main:MBeanRegistry@128] - Unregister
MBean [org.apache.ZooKeeperService:name0=StandaloneServer_port19304,name1=InMemoryDataTree]
    [junit] 2017-02-04 12:15:13,048 [myid:] - INFO  [main:MBeanRegistry@128] - Unregister
MBean [org.apache.ZooKeeperService:name0=StandaloneServer_port19304]
    [junit] 2017-02-04 12:15:13,048 [myid:] - INFO  [main:FourLetterWordMain@85] - connecting
to 127.0.0.1 19304
    [junit] 2017-02-04 12:15:13,049 [myid:] - INFO  [main:JMXEnv@146] - ensureOnly:[]
    [junit] 2017-02-04 12:15:13,069 [myid:] - INFO  [main:ClientBase@568] - fdcount after
test is: 57 at start it was 57
    [junit] 2017-02-04 12:15:13,069 [myid:] - INFO  [main:ZKTestCase$1@65] - SUCCEEDED testManyChildWatchersAutoReset
    [junit] 2017-02-04 12:15:13,069 [myid:] - INFO  [main:ZKTestCase$1@60] - FINISHED testManyChildWatchersAutoReset
    [junit] Tests run: 4, Failures: 0, Errors: 0, Skipped: 0, Time elapsed: 869.972 sec, Thread:
4, Class: org.apache.zookeeper.test.DisconnectedWatcherTest

BUILD FAILED
/home/jenkins/jenkins-slave/workspace/ZooKeeper_branch35_jdk8/build.xml:1210: Tests failed!

Total time: 18 minutes 48 seconds
Build step 'Invoke Ant' marked build as failure
Recording test results
Email was triggered for: Failure - Any
Sending email for trigger: Failure - Any



###################################################################################
############################## FAILED TESTS (if any) ##############################
3 tests failed.
FAILED:  org.apache.zookeeper.test.LETest.testLE

Error Message:
Threads didn't join

Stack Trace:
junit.framework.AssertionFailedError: Threads didn't join
	at org.apache.zookeeper.test.LETest.testLE(LETest.java:123)
	at org.apache.zookeeper.JUnit4ZKTestRunner$LoggedInvokeMethod.evaluate(JUnit4ZKTestRunner.java:79)


FAILED:  org.apache.zookeeper.test.ReconfigTest.testQuorumSystemChange

Error Message:
Waiting for server up

Stack Trace:
junit.framework.AssertionFailedError: Waiting for server up
	at org.apache.zookeeper.test.QuorumUtil.restart(QuorumUtil.java:216)
	at org.apache.zookeeper.test.ReconfigTest.testQuorumSystemChange(ReconfigTest.java:861)
	at org.apache.zookeeper.JUnit4ZKTestRunner$LoggedInvokeMethod.evaluate(JUnit4ZKTestRunner.java:79)


FAILED:  org.apache.zookeeper.test.ReconfigTest.testPortChange

Error Message:
null

Stack Trace:
junit.framework.AssertionFailedError
	at org.apache.zookeeper.test.ReconfigTest.testPortChange(ReconfigTest.java:681)
	at org.apache.zookeeper.JUnit4ZKTestRunner$LoggedInvokeMethod.evaluate(JUnit4ZKTestRunner.java:79)



Mime
  • Unnamed multipart/mixed (inline, None, 0 bytes)
View raw message