zookeeper-dev mailing list archives

Site index · List index
Message view « Date » · « Thread »
Top « Date » · « Thread »
From Apache Jenkins Server <jenk...@builds.apache.org>
Subject ZooKeeper_branch34_jdk8 - Build # 885 - Still Failing
Date Tue, 14 Feb 2017 23:09:08 GMT
See https://builds.apache.org/job/ZooKeeper_branch34_jdk8/885/

###################################################################################
########################## LAST 60 LINES OF THE CONSOLE ###########################
[...truncated 247334 lines...]
    [junit] 2017-02-14 23:09:02,340 [myid:] - INFO  [main:SessionTrackerImpl@225] - Shutting
down
    [junit] 2017-02-14 23:09:02,340 [myid:] - INFO  [main:PrepRequestProcessor@764] - Shutting
down
    [junit] 2017-02-14 23:09:02,340 [myid:] - INFO  [main:SyncRequestProcessor@208] - Shutting
down
    [junit] 2017-02-14 23:09:02,340 [myid:] - INFO  [ProcessThread(sid:0 cport:11221)::PrepRequestProcessor@143]
- PrepRequestProcessor exited loop!
    [junit] 2017-02-14 23:09:02,340 [myid:] - INFO  [SyncThread:0:SyncRequestProcessor@186]
- SyncRequestProcessor exited!
    [junit] 2017-02-14 23:09:02,341 [myid:] - INFO  [main:FinalRequestProcessor@402] - shutdown
of request processor complete
    [junit] 2017-02-14 23:09:02,341 [myid:] - INFO  [main:FourLetterWordMain@62] - connecting
to 127.0.0.1 11221
    [junit] 2017-02-14 23:09:02,342 [myid:] - INFO  [main:JMXEnv@147] - ensureOnly:[]
    [junit] 2017-02-14 23:09:02,343 [myid:] - INFO  [main:ClientBase@445] - STARTING server
    [junit] 2017-02-14 23:09:02,344 [myid:] - INFO  [main:ClientBase@366] - CREATING server
instance 127.0.0.1:11221
    [junit] 2017-02-14 23:09:02,344 [myid:] - INFO  [main:NIOServerCnxnFactory@89] - binding
to port 0.0.0.0/0.0.0.0:11221
    [junit] 2017-02-14 23:09:02,344 [myid:] - INFO  [main:ClientBase@341] - STARTING server
instance 127.0.0.1:11221
    [junit] 2017-02-14 23:09:02,345 [myid:] - INFO  [main:ZooKeeperServer@173] - Created server
with tickTime 3000 minSessionTimeout 6000 maxSessionTimeout 60000 datadir /home/jenkins/jenkins-slave/workspace/ZooKeeper_branch34_jdk8/build/test/tmp/test4941610589486896079.junit.dir/version-2
snapdir /home/jenkins/jenkins-slave/workspace/ZooKeeper_branch34_jdk8/build/test/tmp/test4941610589486896079.junit.dir/version-2
    [junit] 2017-02-14 23:09:02,348 [myid:] - ERROR [main:ZooKeeperServer@472] - ZKShutdownHandler
is not registered, so ZooKeeper server won't take any action on ERROR or SHUTDOWN server state
changes
    [junit] 2017-02-14 23:09:02,348 [myid:] - INFO  [main:FourLetterWordMain@62] - connecting
to 127.0.0.1 11221
    [junit] 2017-02-14 23:09:02,349 [myid:] - INFO  [NIOServerCxn.Factory:0.0.0.0/0.0.0.0:11221:NIOServerCnxnFactory@192]
- Accepted socket connection from /127.0.0.1:55886
    [junit] 2017-02-14 23:09:02,349 [myid:] - INFO  [NIOServerCxn.Factory:0.0.0.0/0.0.0.0:11221:NIOServerCnxn@838]
- Processing stat command from /127.0.0.1:55886
    [junit] 2017-02-14 23:09:02,349 [myid:] - INFO  [Thread-4:NIOServerCnxn$StatCommand@674]
- Stat command output
    [junit] 2017-02-14 23:09:02,350 [myid:] - INFO  [Thread-4:NIOServerCnxn@1019] - Closed
socket connection for client /127.0.0.1:55886 (no session established for client)
    [junit] 2017-02-14 23:09:02,350 [myid:] - INFO  [main:JMXEnv@230] - ensureParent:[InMemoryDataTree,
StandaloneServer_port]
    [junit] 2017-02-14 23:09:02,352 [myid:] - INFO  [main:JMXEnv@247] - expect:InMemoryDataTree
    [junit] 2017-02-14 23:09:02,353 [myid:] - INFO  [main:JMXEnv@251] - found:InMemoryDataTree
org.apache.ZooKeeperService:name0=StandaloneServer_port11221,name1=InMemoryDataTree
    [junit] 2017-02-14 23:09:02,353 [myid:] - INFO  [main:JMXEnv@247] - expect:StandaloneServer_port
    [junit] 2017-02-14 23:09:02,353 [myid:] - INFO  [main:JMXEnv@251] - found:StandaloneServer_port
org.apache.ZooKeeperService:name0=StandaloneServer_port11221
    [junit] 2017-02-14 23:09:02,353 [myid:] - INFO  [main:JUnit4ZKTestRunner$LoggedInvokeMethod@58]
- Memory used 35515
    [junit] 2017-02-14 23:09:02,354 [myid:] - INFO  [main:JUnit4ZKTestRunner$LoggedInvokeMethod@63]
- Number of threads 20
    [junit] 2017-02-14 23:09:02,354 [myid:] - INFO  [main:JUnit4ZKTestRunner$LoggedInvokeMethod@78]
- FINISHED TEST METHOD testQuota
    [junit] 2017-02-14 23:09:02,354 [myid:] - INFO  [main:ClientBase@522] - tearDown starting
    [junit] 2017-02-14 23:09:02,425 [myid:] - INFO  [main:ZooKeeper@684] - Session: 0x15a3ee2e6f90000
closed
    [junit] 2017-02-14 23:09:02,425 [myid:] - INFO  [main:ClientBase@492] - STOPPING server
    [junit] 2017-02-14 23:09:02,425 [myid:] - INFO  [main-EventThread:ClientCnxn$EventThread@519]
- EventThread shut down for session: 0x15a3ee2e6f90000
    [junit] 2017-02-14 23:09:02,425 [myid:] - INFO  [NIOServerCxn.Factory:0.0.0.0/0.0.0.0:11221:NIOServerCnxnFactory@219]
- NIOServerCnxn factory exited run method
    [junit] 2017-02-14 23:09:02,426 [myid:] - INFO  [main:ZooKeeperServer@505] - shutting
down
    [junit] 2017-02-14 23:09:02,426 [myid:] - ERROR [main:ZooKeeperServer@472] - ZKShutdownHandler
is not registered, so ZooKeeper server won't take any action on ERROR or SHUTDOWN server state
changes
    [junit] 2017-02-14 23:09:02,426 [myid:] - INFO  [main:SessionTrackerImpl@225] - Shutting
down
    [junit] 2017-02-14 23:09:02,426 [myid:] - INFO  [main:PrepRequestProcessor@764] - Shutting
down
    [junit] 2017-02-14 23:09:02,427 [myid:] - INFO  [main:SyncRequestProcessor@208] - Shutting
down
    [junit] 2017-02-14 23:09:02,427 [myid:] - INFO  [ProcessThread(sid:0 cport:11221)::PrepRequestProcessor@143]
- PrepRequestProcessor exited loop!
    [junit] 2017-02-14 23:09:02,427 [myid:] - INFO  [SyncThread:0:SyncRequestProcessor@186]
- SyncRequestProcessor exited!
    [junit] 2017-02-14 23:09:02,428 [myid:] - INFO  [main:FinalRequestProcessor@402] - shutdown
of request processor complete
    [junit] 2017-02-14 23:09:02,428 [myid:] - INFO  [main:FourLetterWordMain@62] - connecting
to 127.0.0.1 11221
    [junit] 2017-02-14 23:09:02,429 [myid:] - INFO  [main:JMXEnv@147] - ensureOnly:[]
    [junit] 2017-02-14 23:09:02,433 [myid:] - INFO  [main:ClientBase@547] - fdcount after
test is: 95 at start it was 77
    [junit] 2017-02-14 23:09:02,433 [myid:] - INFO  [main:ClientBase@549] - sleeping for 20
secs
    [junit] 2017-02-14 23:09:02,434 [myid:] - INFO  [main:ZKTestCase$1@65] - SUCCEEDED testQuota
    [junit] 2017-02-14 23:09:02,434 [myid:] - INFO  [main:ZKTestCase$1@60] - FINISHED testQuota
    [junit] Tests run: 1, Failures: 0, Errors: 0, Skipped: 0, Time elapsed: 0.718 sec

fail.build.on.test.failure:

BUILD FAILED
/home/jenkins/jenkins-slave/workspace/ZooKeeper_branch34_jdk8/build.xml:1328: The following
error occurred while executing this line:
/home/jenkins/jenkins-slave/workspace/ZooKeeper_branch34_jdk8/build.xml:1331: Tests failed!

Total time: 39 minutes 54 seconds
Build step 'Invoke Ant' marked build as failure
Recording test results
Email was triggered for: Failure - Any
Sending email for trigger: Failure - Any



###################################################################################
############################## FAILED TESTS (if any) ##############################
3 tests failed.
FAILED:  org.apache.zookeeper.test.FollowerTest.testNoLogBeforeLeaderEstablishment

Error Message:
Forked Java VM exited abnormally. Please note the time in the report does not reflect the
time until the VM exit.

Stack Trace:
junit.framework.AssertionFailedError: Forked Java VM exited abnormally. Please note the time
in the report does not reflect the time until the VM exit.


FAILED:  org.apache.zookeeper.server.quorum.auth.QuorumKerberosAuthTest.testValidCredentials

Error Message:
waiting for server 0 being up

Stack Trace:
junit.framework.AssertionFailedError: waiting for server 0 being up
	at org.apache.zookeeper.server.quorum.auth.QuorumAuthTestBase.startQuorum(QuorumAuthTestBase.java:74)
	at org.apache.zookeeper.server.quorum.auth.QuorumKerberosAuthTest.testValidCredentials(QuorumKerberosAuthTest.java:101)
	at org.apache.zookeeper.JUnit4ZKTestRunner$LoggedInvokeMethod.evaluate(JUnit4ZKTestRunner.java:55)


FAILED:  org.apache.zookeeper.server.quorum.auth.QuorumKerberosHostBasedAuthTest.testValidCredentials

Error Message:
waiting for server 2 being up

Stack Trace:
junit.framework.AssertionFailedError: waiting for server 2 being up
	at org.apache.zookeeper.server.quorum.auth.QuorumAuthTestBase.startQuorum(QuorumAuthTestBase.java:74)
	at org.apache.zookeeper.server.quorum.auth.QuorumKerberosHostBasedAuthTest.testValidCredentials(QuorumKerberosHostBasedAuthTest.java:125)
	at org.apache.zookeeper.JUnit4ZKTestRunner$LoggedInvokeMethod.evaluate(JUnit4ZKTestRunner.java:55)



Mime
  • Unnamed multipart/mixed (inline, None, 0 bytes)
View raw message