zookeeper-dev mailing list archives

Site index · List index
Message view « Date » · « Thread »
Top « Date » · « Thread »
From Apache Jenkins Server <jenk...@builds.apache.org>
Subject ZooKeeper_branch35_solaris - Build # 419 - Still Failing
Date Thu, 02 Feb 2017 16:12:18 GMT
See https://builds.apache.org/job/ZooKeeper_branch35_solaris/419/

###################################################################################
########################## LAST 60 LINES OF THE CONSOLE ###########################
[...truncated 940 lines...]
    [junit] 2017-02-02 16:13:49,006 [myid:] - INFO  [NIOServerCxnFactory.AcceptThread:0.0.0.0/0.0.0.0:11228:NIOServerCnxnFactory$AcceptThread@296]
- Accepted socket connection from /127.0.0.1:36747
    [junit] 2017-02-02 16:13:49,022 [myid:] - INFO  [NIOWorkerThread-2:ZooKeeperServer@999]
- Client attempting to establish new session at /127.0.0.1:36747
    [junit] 2017-02-02 16:13:49,023 [myid:] - INFO  [SyncThread:0:FileTxnLog@204] - Creating
new log file: log.1
    [junit] 2017-02-02 16:13:49,026 [myid:] - INFO  [SyncThread:0:ZooKeeperServer@713] - Established
session 0x1267c9390380000 with negotiated timeout 30000 for client /127.0.0.1:36747
    [junit] 2017-02-02 16:13:49,027 [myid:127.0.0.1:11228] - INFO  [main-SendThread(127.0.0.1:11228):ClientCnxn$SendThread@1381]
- Session establishment complete on server null, sessionid = 0x1267c9390380000, negotiated
timeout = 30000
    [junit] 2017-02-02 16:13:49,028 [myid:] - INFO  [main:JMXEnv@117] - expect:0x1267c9390380000
    [junit] 2017-02-02 16:13:49,028 [myid:] - INFO  [main:JMXEnv@120] - found:0x1267c9390380000
org.apache.ZooKeeperService:name0=StandaloneServer_port11228,name1=Connections,name2=127.0.0.1,name3=0x1267c9390380000
    [junit] 2017-02-02 16:13:49,028 [myid:] - INFO  [Time-limited test:JUnit4ZKTestRunner$LoggedInvokeMethod@77]
- RUNNING TEST METHOD testRemoveNodeChildrenChangedWatches
    [junit] 2017-02-02 16:13:49,032 [myid:] - INFO  [Time-limited test:RemoveWatchesCmdTest@181]
- Adding child changed watcher
    [junit] 2017-02-02 16:13:49,033 [myid:] - INFO  [Time-limited test:RemoveWatchesCmdTest@185]
- Remove watchers using shell command : removewatches /testnode1 -c
    [junit] 2017-02-02 16:13:49,034 [myid:] - INFO  [Time-limited test:JUnit4ZKTestRunner$LoggedInvokeMethod@82]
- Memory used 6709
    [junit] 2017-02-02 16:13:49,035 [myid:] - INFO  [Time-limited test:JUnit4ZKTestRunner$LoggedInvokeMethod@87]
- Number of threads 38
    [junit] 2017-02-02 16:13:49,035 [myid:] - INFO  [Time-limited test:JUnit4ZKTestRunner$LoggedInvokeMethod@102]
- FINISHED TEST METHOD testRemoveNodeChildrenChangedWatches
    [junit] 2017-02-02 16:13:49,035 [myid:] - INFO  [ProcessThread(sid:0 cport:11228)::PrepRequestProcessor@656]
- Processed session termination for sessionid: 0x1267c9390380000
    [junit] 2017-02-02 16:13:49,036 [myid:] - INFO  [NIOWorkerThread-11:MBeanRegistry@128]
- Unregister MBean [org.apache.ZooKeeperService:name0=StandaloneServer_port11228,name1=Connections,name2=127.0.0.1,name3=0x1267c9390380000]
    [junit] 2017-02-02 16:13:49,036 [myid:] - INFO  [main-EventThread:ClientCnxn$EventThread@513]
- EventThread shut down for session: 0x1267c9390380000
    [junit] 2017-02-02 16:13:49,036 [myid:] - INFO  [main:ZooKeeper@1322] - Session: 0x1267c9390380000
closed
    [junit] 2017-02-02 16:13:49,037 [myid:] - INFO  [main:ClientBase@543] - tearDown starting
    [junit] 2017-02-02 16:13:49,037 [myid:] - INFO  [NIOWorkerThread-11:NIOServerCnxn@614]
- Closed socket connection for client /127.0.0.1:36747 which had sessionid 0x1267c9390380000
    [junit] 2017-02-02 16:13:49,037 [myid:] - INFO  [main:ClientBase@513] - STOPPING server
    [junit] 2017-02-02 16:13:49,038 [myid:] - INFO  [ConnnectionExpirer:NIOServerCnxnFactory$ConnectionExpirerThread@583]
- ConnnectionExpirerThread interrupted
    [junit] 2017-02-02 16:13:49,051 [myid:] - INFO  [NIOServerCxnFactory.SelectorThread-1:NIOServerCnxnFactory$SelectorThread@420]
- selector thread exitted run method
    [junit] 2017-02-02 16:13:49,051 [myid:] - INFO  [NIOServerCxnFactory.SelectorThread-0:NIOServerCnxnFactory$SelectorThread@420]
- selector thread exitted run method
    [junit] 2017-02-02 16:13:49,066 [myid:] - INFO  [NIOServerCxnFactory.AcceptThread:0.0.0.0/0.0.0.0:11228:NIOServerCnxnFactory$AcceptThread@219]
- accept thread exitted run method
    [junit] 2017-02-02 16:13:49,072 [myid:] - INFO  [main:ZooKeeperServer@533] - shutting
down
    [junit] 2017-02-02 16:13:49,073 [myid:] - ERROR [main:ZooKeeperServer@505] - ZKShutdownHandler
is not registered, so ZooKeeper server won't take any action on ERROR or SHUTDOWN server state
changes
    [junit] 2017-02-02 16:13:49,073 [myid:] - INFO  [main:SessionTrackerImpl@232] - Shutting
down
    [junit] 2017-02-02 16:13:49,073 [myid:] - INFO  [main:PrepRequestProcessor@974] - Shutting
down
    [junit] 2017-02-02 16:13:49,074 [myid:] - INFO  [main:SyncRequestProcessor@191] - Shutting
down
    [junit] 2017-02-02 16:13:49,074 [myid:] - INFO  [ProcessThread(sid:0 cport:11228)::PrepRequestProcessor@154]
- PrepRequestProcessor exited loop!
    [junit] 2017-02-02 16:13:49,074 [myid:] - INFO  [SyncThread:0:SyncRequestProcessor@169]
- SyncRequestProcessor exited!
    [junit] 2017-02-02 16:13:49,076 [myid:] - INFO  [main:FinalRequestProcessor@479] - shutdown
of request processor complete
    [junit] 2017-02-02 16:13:49,077 [myid:] - INFO  [main:MBeanRegistry@128] - Unregister
MBean [org.apache.ZooKeeperService:name0=StandaloneServer_port11228,name1=InMemoryDataTree]
    [junit] 2017-02-02 16:13:49,078 [myid:] - INFO  [main:MBeanRegistry@128] - Unregister
MBean [org.apache.ZooKeeperService:name0=StandaloneServer_port11228]
    [junit] 2017-02-02 16:13:49,078 [myid:] - INFO  [main:FourLetterWordMain@85] - connecting
to 127.0.0.1 11228
    [junit] 2017-02-02 16:13:49,079 [myid:] - INFO  [main:JMXEnv@146] - ensureOnly:[]
    [junit] 2017-02-02 16:13:49,130 [myid:] - INFO  [main:ClientBase@568] - fdcount after
test is: 62 at start it was 62
    [junit] 2017-02-02 16:13:49,130 [myid:] - INFO  [main:ZKTestCase$1@65] - SUCCEEDED testRemoveNodeChildrenChangedWatches
    [junit] 2017-02-02 16:13:49,130 [myid:] - INFO  [main:ZKTestCase$1@60] - FINISHED testRemoveNodeChildrenChangedWatches
    [junit] Tests run: 7, Failures: 0, Errors: 0, Time elapsed: 14.166 sec
    [junit] 2017-02-02 16:13:49,261 [myid:] - INFO  [SessionTracker:SessionTrackerImpl@158]
- SessionTrackerImpl exited loop!
    [junit] 2017-02-02 16:13:49,261 [myid:] - INFO  [SessionTracker:SessionTrackerImpl@158]
- SessionTrackerImpl exited loop!
    [junit] 2017-02-02 16:13:49,261 [myid:] - INFO  [SessionTracker:SessionTrackerImpl@158]
- SessionTrackerImpl exited loop!
    [junit] 2017-02-02 16:13:49,261 [myid:] - INFO  [SessionTracker:SessionTrackerImpl@158]
- SessionTrackerImpl exited loop!
    [junit] 2017-02-02 16:13:49,261 [myid:] - INFO  [SessionTracker:SessionTrackerImpl@158]
- SessionTrackerImpl exited loop!
    [junit] 2017-02-02 16:13:49,262 [myid:] - INFO  [SessionTracker:SessionTrackerImpl@158]
- SessionTrackerImpl exited loop!
    [junit] Running org.apache.zookeeper.RemoveWatchesTest
    [junit] Tests run: 1, Failures: 0, Errors: 1, Time elapsed: 0 sec

BUILD FAILED
/zonestorage/hudson_solaris/home/hudson/hudson-slave/workspace/ZooKeeper_branch35_solaris/build.xml:1222:
Process fork failed.

Total time: 3 minutes 50 seconds
Build step 'Invoke Ant' marked build as failure
[locks-and-latches] Releasing all the locks
[locks-and-latches] All the locks released
Recording test results
Email was triggered for: Failure - Any
Sending email for trigger: Failure - Any



###################################################################################
############################## FAILED TESTS (if any) ##############################
1 tests failed.
FAILED:  org.apache.zookeeper.RemoveWatchesTest.unknown

Error Message:
Forked Java VM exited abnormally. Please note the time in the report does not reflect the
time until the VM exit.

Stack Trace:
junit.framework.AssertionFailedError: Forked Java VM exited abnormally. Please note the time
in the report does not reflect the time until the VM exit.



Mime
  • Unnamed multipart/mixed (inline, None, 0 bytes)
View raw message