zookeeper-dev mailing list archives

Site index · List index
Message view « Date » · « Thread »
Top « Date » · « Thread »
From Apache Jenkins Server <jenk...@builds.apache.org>
Subject ZooKeeper_branch34_jdk7 - Build # 1408 - Still Failing
Date Thu, 16 Feb 2017 02:15:48 GMT
See https://builds.apache.org/job/ZooKeeper_branch34_jdk7/1408/

###################################################################################
########################## LAST 60 LINES OF THE CONSOLE ###########################
[...truncated 242506 lines...]
    [junit] 2017-02-16 02:15:44,836 [myid:] - INFO  [main:SessionTrackerImpl@225] - Shutting
down
    [junit] 2017-02-16 02:15:44,836 [myid:] - INFO  [main:PrepRequestProcessor@764] - Shutting
down
    [junit] 2017-02-16 02:15:44,837 [myid:] - INFO  [main:SyncRequestProcessor@208] - Shutting
down
    [junit] 2017-02-16 02:15:44,837 [myid:] - INFO  [ProcessThread(sid:0 cport:11221)::PrepRequestProcessor@143]
- PrepRequestProcessor exited loop!
    [junit] 2017-02-16 02:15:44,837 [myid:] - INFO  [SyncThread:0:SyncRequestProcessor@186]
- SyncRequestProcessor exited!
    [junit] 2017-02-16 02:15:44,837 [myid:] - INFO  [main:FinalRequestProcessor@402] - shutdown
of request processor complete
    [junit] 2017-02-16 02:15:44,838 [myid:] - INFO  [main:FourLetterWordMain@62] - connecting
to 127.0.0.1 11221
    [junit] 2017-02-16 02:15:44,838 [myid:] - INFO  [main:JMXEnv@147] - ensureOnly:[]
    [junit] 2017-02-16 02:15:44,840 [myid:] - INFO  [main:ClientBase@445] - STARTING server
    [junit] 2017-02-16 02:15:44,840 [myid:] - INFO  [main:ClientBase@366] - CREATING server
instance 127.0.0.1:11221
    [junit] 2017-02-16 02:15:44,841 [myid:] - INFO  [main:NIOServerCnxnFactory@89] - binding
to port 0.0.0.0/0.0.0.0:11221
    [junit] 2017-02-16 02:15:44,841 [myid:] - INFO  [main:ClientBase@341] - STARTING server
instance 127.0.0.1:11221
    [junit] 2017-02-16 02:15:44,841 [myid:] - INFO  [main:ZooKeeperServer@173] - Created server
with tickTime 3000 minSessionTimeout 6000 maxSessionTimeout 60000 datadir /home/jenkins/jenkins-slave/workspace/ZooKeeper_branch34_jdk7/build/test/tmp/test1454687885659404818.junit.dir/version-2
snapdir /home/jenkins/jenkins-slave/workspace/ZooKeeper_branch34_jdk7/build/test/tmp/test1454687885659404818.junit.dir/version-2
    [junit] 2017-02-16 02:15:44,845 [myid:] - ERROR [main:ZooKeeperServer@472] - ZKShutdownHandler
is not registered, so ZooKeeper server won't take any action on ERROR or SHUTDOWN server state
changes
    [junit] 2017-02-16 02:15:44,845 [myid:] - INFO  [main:FourLetterWordMain@62] - connecting
to 127.0.0.1 11221
    [junit] 2017-02-16 02:15:44,846 [myid:] - INFO  [NIOServerCxn.Factory:0.0.0.0/0.0.0.0:11221:NIOServerCnxnFactory@192]
- Accepted socket connection from /127.0.0.1:55663
    [junit] 2017-02-16 02:15:44,846 [myid:] - INFO  [NIOServerCxn.Factory:0.0.0.0/0.0.0.0:11221:NIOServerCnxn@838]
- Processing stat command from /127.0.0.1:55663
    [junit] 2017-02-16 02:15:44,847 [myid:] - INFO  [Thread-4:NIOServerCnxn$StatCommand@674]
- Stat command output
    [junit] 2017-02-16 02:15:44,847 [myid:] - INFO  [Thread-4:NIOServerCnxn@1019] - Closed
socket connection for client /127.0.0.1:55663 (no session established for client)
    [junit] 2017-02-16 02:15:44,848 [myid:] - INFO  [main:JMXEnv@230] - ensureParent:[InMemoryDataTree,
StandaloneServer_port]
    [junit] 2017-02-16 02:15:44,850 [myid:] - INFO  [main:JMXEnv@247] - expect:InMemoryDataTree
    [junit] 2017-02-16 02:15:44,850 [myid:] - INFO  [main:JMXEnv@251] - found:InMemoryDataTree
org.apache.ZooKeeperService:name0=StandaloneServer_port11221,name1=InMemoryDataTree
    [junit] 2017-02-16 02:15:44,850 [myid:] - INFO  [main:JMXEnv@247] - expect:StandaloneServer_port
    [junit] 2017-02-16 02:15:44,851 [myid:] - INFO  [main:JMXEnv@251] - found:StandaloneServer_port
org.apache.ZooKeeperService:name0=StandaloneServer_port11221
    [junit] 2017-02-16 02:15:44,851 [myid:] - INFO  [main:JUnit4ZKTestRunner$LoggedInvokeMethod@58]
- Memory used 35674
    [junit] 2017-02-16 02:15:44,851 [myid:] - INFO  [main:JUnit4ZKTestRunner$LoggedInvokeMethod@63]
- Number of threads 20
    [junit] 2017-02-16 02:15:44,851 [myid:] - INFO  [main:JUnit4ZKTestRunner$LoggedInvokeMethod@78]
- FINISHED TEST METHOD testQuota
    [junit] 2017-02-16 02:15:44,852 [myid:] - INFO  [main:ClientBase@522] - tearDown starting
    [junit] 2017-02-16 02:15:44,918 [myid:] - INFO  [main:ZooKeeper@684] - Session: 0x15a44b433280000
closed
    [junit] 2017-02-16 02:15:44,919 [myid:] - INFO  [main:ClientBase@492] - STOPPING server
    [junit] 2017-02-16 02:15:44,919 [myid:] - INFO  [NIOServerCxn.Factory:0.0.0.0/0.0.0.0:11221:NIOServerCnxnFactory@219]
- NIOServerCnxn factory exited run method
    [junit] 2017-02-16 02:15:44,919 [myid:] - INFO  [main-EventThread:ClientCnxn$EventThread@519]
- EventThread shut down for session: 0x15a44b433280000
    [junit] 2017-02-16 02:15:44,919 [myid:] - INFO  [main:ZooKeeperServer@505] - shutting
down
    [junit] 2017-02-16 02:15:44,920 [myid:] - ERROR [main:ZooKeeperServer@472] - ZKShutdownHandler
is not registered, so ZooKeeper server won't take any action on ERROR or SHUTDOWN server state
changes
    [junit] 2017-02-16 02:15:44,920 [myid:] - INFO  [main:SessionTrackerImpl@225] - Shutting
down
    [junit] 2017-02-16 02:15:44,920 [myid:] - INFO  [main:PrepRequestProcessor@764] - Shutting
down
    [junit] 2017-02-16 02:15:44,920 [myid:] - INFO  [main:SyncRequestProcessor@208] - Shutting
down
    [junit] 2017-02-16 02:15:44,921 [myid:] - INFO  [SyncThread:0:SyncRequestProcessor@186]
- SyncRequestProcessor exited!
    [junit] 2017-02-16 02:15:44,921 [myid:] - INFO  [ProcessThread(sid:0 cport:11221)::PrepRequestProcessor@143]
- PrepRequestProcessor exited loop!
    [junit] 2017-02-16 02:15:44,921 [myid:] - INFO  [main:FinalRequestProcessor@402] - shutdown
of request processor complete
    [junit] 2017-02-16 02:15:44,922 [myid:] - INFO  [main:FourLetterWordMain@62] - connecting
to 127.0.0.1 11221
    [junit] 2017-02-16 02:15:44,922 [myid:] - INFO  [main:JMXEnv@147] - ensureOnly:[]
    [junit] 2017-02-16 02:15:44,926 [myid:] - INFO  [main:ClientBase@547] - fdcount after
test is: 90 at start it was 78
    [junit] 2017-02-16 02:15:44,926 [myid:] - INFO  [main:ClientBase@549] - sleeping for 20
secs
    [junit] 2017-02-16 02:15:44,927 [myid:] - INFO  [main:ZKTestCase$1@65] - SUCCEEDED testQuota
    [junit] 2017-02-16 02:15:44,928 [myid:] - INFO  [main:ZKTestCase$1@60] - FINISHED testQuota
    [junit] Tests run: 1, Failures: 0, Errors: 0, Skipped: 0, Time elapsed: 0.555 sec

fail.build.on.test.failure:

BUILD FAILED
/home/jenkins/jenkins-slave/workspace/ZooKeeper_branch34_jdk7/build.xml:1328: The following
error occurred while executing this line:
/home/jenkins/jenkins-slave/workspace/ZooKeeper_branch34_jdk7/build.xml:1331: Tests failed!

Total time: 28 minutes 44 seconds
Build step 'Invoke Ant' marked build as failure
Recording test results
Email was triggered for: Failure - Any
Sending email for trigger: Failure - Any



###################################################################################
############################## FAILED TESTS (if any) ##############################
1 tests failed.
FAILED:  org.apache.zookeeper.server.quorum.auth.QuorumKerberosAuthTest.testValidCredentials

Error Message:
waiting for server 0 being up

Stack Trace:
junit.framework.AssertionFailedError: waiting for server 0 being up
	at org.apache.zookeeper.server.quorum.auth.QuorumAuthTestBase.startQuorum(QuorumAuthTestBase.java:74)
	at org.apache.zookeeper.server.quorum.auth.QuorumKerberosAuthTest.testValidCredentials(QuorumKerberosAuthTest.java:101)
	at org.apache.zookeeper.JUnit4ZKTestRunner$LoggedInvokeMethod.evaluate(JUnit4ZKTestRunner.java:55)



Mime
  • Unnamed multipart/mixed (inline, None, 0 bytes)
View raw message