zookeeper-dev mailing list archives

Site index · List index
Message view « Date » · « Thread »
Top « Date » · « Thread »
From Apache Jenkins Server <jenk...@builds.apache.org>
Subject ZooKeeper_branch35_solaris - Build # 404 - Still Failing
Date Sun, 22 Jan 2017 17:13:58 GMT
See https://builds.apache.org/job/ZooKeeper_branch35_solaris/404/

###################################################################################
########################## LAST 60 LINES OF THE CONSOLE ###########################
[...truncated 467510 lines...]
    [junit] 2017-01-22 17:15:03,534 [myid:] - INFO  [main:ClientBase@386] - CREATING server
instance 127.0.0.1:11222
    [junit] 2017-01-22 17:15:03,534 [myid:] - INFO  [main:NIOServerCnxnFactory@673] - Configuring
NIO connection handler with 10s sessionless connection timeout, 2 selector thread(s), 16 worker
threads, and 64 kB direct buffers.
    [junit] 2017-01-22 17:15:03,535 [myid:] - INFO  [main:NIOServerCnxnFactory@686] - binding
to port 0.0.0.0/0.0.0.0:11222
    [junit] 2017-01-22 17:15:03,535 [myid:] - INFO  [main:ClientBase@361] - STARTING server
instance 127.0.0.1:11222
    [junit] 2017-01-22 17:15:03,536 [myid:] - INFO  [main:ZooKeeperServer@893] - minSessionTimeout
set to 6000
    [junit] 2017-01-22 17:15:03,536 [myid:] - INFO  [main:ZooKeeperServer@902] - maxSessionTimeout
set to 60000
    [junit] 2017-01-22 17:15:03,536 [myid:] - INFO  [main:ZooKeeperServer@159] - Created server
with tickTime 3000 minSessionTimeout 6000 maxSessionTimeout 60000 datadir /zonestorage/hudson_solaris/home/hudson/hudson-slave/workspace/ZooKeeper_branch35_solaris/build/test/tmp/test7405210766105230385.junit.dir/version-2
snapdir /zonestorage/hudson_solaris/home/hudson/hudson-slave/workspace/ZooKeeper_branch35_solaris/build/test/tmp/test7405210766105230385.junit.dir/version-2
    [junit] 2017-01-22 17:15:03,537 [myid:] - INFO  [main:FileSnap@83] - Reading snapshot
/zonestorage/hudson_solaris/home/hudson/hudson-slave/workspace/ZooKeeper_branch35_solaris/build/test/tmp/test7405210766105230385.junit.dir/version-2/snapshot.b
    [junit] 2017-01-22 17:15:03,539 [myid:] - INFO  [main:FileTxnSnapLog@320] - Snapshotting:
0xb to /zonestorage/hudson_solaris/home/hudson/hudson-slave/workspace/ZooKeeper_branch35_solaris/build/test/tmp/test7405210766105230385.junit.dir/version-2/snapshot.b
    [junit] 2017-01-22 17:15:03,540 [myid:] - ERROR [main:ZooKeeperServer@505] - ZKShutdownHandler
is not registered, so ZooKeeper server won't take any action on ERROR or SHUTDOWN server state
changes
    [junit] 2017-01-22 17:15:03,540 [myid:] - INFO  [main:FourLetterWordMain@85] - connecting
to 127.0.0.1 11222
    [junit] 2017-01-22 17:15:03,571 [myid:] - INFO  [NIOServerCxnFactory.AcceptThread:0.0.0.0/0.0.0.0:11222:NIOServerCnxnFactory$AcceptThread@296]
- Accepted socket connection from /127.0.0.1:45147
    [junit] 2017-01-22 17:15:03,572 [myid:] - INFO  [NIOWorkerThread-1:NIOServerCnxn@485]
- Processing stat command from /127.0.0.1:45147
    [junit] 2017-01-22 17:15:03,572 [myid:] - INFO  [NIOWorkerThread-1:StatCommand@49] - Stat
command output
    [junit] 2017-01-22 17:15:03,572 [myid:] - INFO  [NIOWorkerThread-1:NIOServerCnxn@614]
- Closed socket connection for client /127.0.0.1:45147 (no session established for client)
    [junit] 2017-01-22 17:15:03,573 [myid:] - INFO  [main:JMXEnv@228] - ensureParent:[InMemoryDataTree,
StandaloneServer_port]
    [junit] 2017-01-22 17:15:03,574 [myid:] - INFO  [main:JMXEnv@245] - expect:InMemoryDataTree
    [junit] 2017-01-22 17:15:03,574 [myid:] - INFO  [main:JMXEnv@249] - found:InMemoryDataTree
org.apache.ZooKeeperService:name0=StandaloneServer_port11222,name1=InMemoryDataTree
    [junit] 2017-01-22 17:15:03,574 [myid:] - INFO  [main:JMXEnv@245] - expect:StandaloneServer_port
    [junit] 2017-01-22 17:15:03,574 [myid:] - INFO  [main:JMXEnv@249] - found:StandaloneServer_port
org.apache.ZooKeeperService:name0=StandaloneServer_port11222
    [junit] 2017-01-22 17:15:03,575 [myid:] - INFO  [main:JUnit4ZKTestRunner$LoggedInvokeMethod@82]
- Memory used 17885
    [junit] 2017-01-22 17:15:03,575 [myid:] - INFO  [main:JUnit4ZKTestRunner$LoggedInvokeMethod@87]
- Number of threads 24
    [junit] 2017-01-22 17:15:03,575 [myid:] - INFO  [main:JUnit4ZKTestRunner$LoggedInvokeMethod@102]
- FINISHED TEST METHOD testQuota
    [junit] 2017-01-22 17:15:03,575 [myid:] - INFO  [main:ClientBase@543] - tearDown starting
    [junit] 2017-01-22 17:15:03,612 [myid:] - INFO  [main:ZooKeeper@1322] - Session: 0x1264425db710000
closed
    [junit] 2017-01-22 17:15:03,612 [myid:] - INFO  [main:ClientBase@513] - STOPPING server
    [junit] 2017-01-22 17:15:03,612 [myid:] - INFO  [main-EventThread:ClientCnxn$EventThread@513]
- EventThread shut down for session: 0x1264425db710000
    [junit] 2017-01-22 17:15:03,612 [myid:] - INFO  [ConnnectionExpirer:NIOServerCnxnFactory$ConnectionExpirerThread@583]
- ConnnectionExpirerThread interrupted
    [junit] 2017-01-22 17:15:03,613 [myid:] - INFO  [NIOServerCxnFactory.SelectorThread-1:NIOServerCnxnFactory$SelectorThread@420]
- selector thread exitted run method
    [junit] 2017-01-22 17:15:03,613 [myid:] - INFO  [NIOServerCxnFactory.SelectorThread-0:NIOServerCnxnFactory$SelectorThread@420]
- selector thread exitted run method
    [junit] 2017-01-22 17:15:03,613 [myid:] - INFO  [NIOServerCxnFactory.AcceptThread:0.0.0.0/0.0.0.0:11222:NIOServerCnxnFactory$AcceptThread@219]
- accept thread exitted run method
    [junit] 2017-01-22 17:15:03,613 [myid:] - INFO  [main:ZooKeeperServer@533] - shutting
down
    [junit] 2017-01-22 17:15:03,613 [myid:] - ERROR [main:ZooKeeperServer@505] - ZKShutdownHandler
is not registered, so ZooKeeper server won't take any action on ERROR or SHUTDOWN server state
changes
    [junit] 2017-01-22 17:15:03,614 [myid:] - INFO  [main:SessionTrackerImpl@232] - Shutting
down
    [junit] 2017-01-22 17:15:03,614 [myid:] - INFO  [main:PrepRequestProcessor@974] - Shutting
down
    [junit] 2017-01-22 17:15:03,614 [myid:] - INFO  [main:SyncRequestProcessor@191] - Shutting
down
    [junit] 2017-01-22 17:15:03,614 [myid:] - INFO  [ProcessThread(sid:0 cport:11222)::PrepRequestProcessor@154]
- PrepRequestProcessor exited loop!
    [junit] 2017-01-22 17:15:03,614 [myid:] - INFO  [SyncThread:0:SyncRequestProcessor@169]
- SyncRequestProcessor exited!
    [junit] 2017-01-22 17:15:03,614 [myid:] - INFO  [main:FinalRequestProcessor@479] - shutdown
of request processor complete
    [junit] 2017-01-22 17:15:03,615 [myid:] - INFO  [main:MBeanRegistry@128] - Unregister
MBean [org.apache.ZooKeeperService:name0=StandaloneServer_port11222,name1=InMemoryDataTree]
    [junit] 2017-01-22 17:15:03,615 [myid:] - INFO  [main:MBeanRegistry@128] - Unregister
MBean [org.apache.ZooKeeperService:name0=StandaloneServer_port11222]
    [junit] 2017-01-22 17:15:03,615 [myid:] - INFO  [main:FourLetterWordMain@85] - connecting
to 127.0.0.1 11222
    [junit] 2017-01-22 17:15:03,616 [myid:] - INFO  [main:JMXEnv@146] - ensureOnly:[]
    [junit] 2017-01-22 17:15:03,620 [myid:] - INFO  [main:ClientBase@568] - fdcount after
test is: 60 at start it was 43
    [junit] 2017-01-22 17:15:03,620 [myid:] - INFO  [main:ClientBase@570] - sleeping for 20
secs
    [junit] 2017-01-22 17:15:03,621 [myid:] - INFO  [main:ZKTestCase$1@65] - SUCCEEDED testQuota
    [junit] 2017-01-22 17:15:03,621 [myid:] - INFO  [main:ZKTestCase$1@60] - FINISHED testQuota
    [junit] Tests run: 1, Failures: 0, Errors: 0, Time elapsed: 0.953 sec

BUILD FAILED
/zonestorage/hudson_solaris/home/hudson/hudson-slave/workspace/ZooKeeper_branch35_solaris/build.xml:1236:
Tests failed!

Total time: 65 minutes 36 seconds
Build step 'Invoke Ant' marked build as failure
[locks-and-latches] Releasing all the locks
[locks-and-latches] All the locks released
Recording test results
Email was triggered for: Failure - Any
Sending email for trigger: Failure - Any



###################################################################################
############################## FAILED TESTS (if any) ##############################
3 tests failed.
FAILED:  org.apache.zookeeper.server.admin.JettyAdminServerTest.testQuorum

Error Message:
Connection refused

Stack Trace:
java.net.ConnectException: Connection refused
	at java.net.PlainSocketImpl.socketConnect(Native Method)
	at java.net.AbstractPlainSocketImpl.doConnect(AbstractPlainSocketImpl.java:339)
	at java.net.AbstractPlainSocketImpl.connectToAddress(AbstractPlainSocketImpl.java:200)
	at java.net.AbstractPlainSocketImpl.connect(AbstractPlainSocketImpl.java:182)
	at java.net.SocksSocketImpl.connect(SocksSocketImpl.java:392)
	at java.net.Socket.connect(Socket.java:579)
	at java.net.Socket.connect(Socket.java:528)
	at sun.net.NetworkClient.doConnect(NetworkClient.java:180)
	at sun.net.www.http.HttpClient.openServer(HttpClient.java:432)
	at sun.net.www.http.HttpClient.openServer(HttpClient.java:527)
	at sun.net.www.http.HttpClient.<init>(HttpClient.java:211)
	at sun.net.www.http.HttpClient.New(HttpClient.java:308)
	at sun.net.www.http.HttpClient.New(HttpClient.java:326)
	at sun.net.www.protocol.http.HttpURLConnection.getNewHttpClient(HttpURLConnection.java:997)
	at sun.net.www.protocol.http.HttpURLConnection.plainConnect(HttpURLConnection.java:933)
	at sun.net.www.protocol.http.HttpURLConnection.connect(HttpURLConnection.java:851)
	at sun.net.www.protocol.http.HttpURLConnection.getInputStream(HttpURLConnection.java:1301)
	at java.net.URL.openStream(URL.java:1037)
	at org.apache.zookeeper.server.admin.JettyAdminServerTest.queryAdminServer(JettyAdminServerTest.java:158)
	at org.apache.zookeeper.server.admin.JettyAdminServerTest.queryAdminServer(JettyAdminServerTest.java:150)
	at org.apache.zookeeper.server.admin.JettyAdminServerTest.testQuorum(JettyAdminServerTest.java:131)
	at org.apache.zookeeper.JUnit4ZKTestRunner$LoggedInvokeMethod.evaluate(JUnit4ZKTestRunner.java:79)


FAILED:  org.apache.zookeeper.test.ReconfigTest.testPortChangeToBlockedPortLeader

Error Message:
client could not connect to reestablished quorum: giving up after 30+ seconds.

Stack Trace:
junit.framework.AssertionFailedError: client could not connect to reestablished quorum: giving
up after 30+ seconds.
	at org.apache.zookeeper.test.ReconfigTest.testNormalOperation(ReconfigTest.java:183)
	at org.apache.zookeeper.test.ReconfigTest.testPortChangeToBlockedPort(ReconfigTest.java:796)
	at org.apache.zookeeper.test.ReconfigTest.testPortChangeToBlockedPortLeader(ReconfigTest.java:719)
	at org.apache.zookeeper.JUnit4ZKTestRunner$LoggedInvokeMethod.evaluate(JUnit4ZKTestRunner.java:79)


FAILED:  org.apache.zookeeper.test.ReconfigTest.testPortChangeToBlockedPortFollower

Error Message:
client could not connect to reestablished quorum: giving up after 30+ seconds.

Stack Trace:
junit.framework.AssertionFailedError: client could not connect to reestablished quorum: giving
up after 30+ seconds.
	at org.apache.zookeeper.test.ReconfigTest.testNormalOperation(ReconfigTest.java:183)
	at org.apache.zookeeper.test.ReconfigTest.testPortChangeToBlockedPort(ReconfigTest.java:796)
	at org.apache.zookeeper.test.ReconfigTest.testPortChangeToBlockedPortFollower(ReconfigTest.java:715)
	at org.apache.zookeeper.JUnit4ZKTestRunner$LoggedInvokeMethod.evaluate(JUnit4ZKTestRunner.java:79)



Mime
  • Unnamed multipart/mixed (inline, None, 0 bytes)
View raw message