zookeeper-dev mailing list archives

Site index · List index
Message view « Date » · « Thread »
Top « Date » · « Thread »
From Apache Jenkins Server <jenk...@builds.apache.org>
Subject ZooKeeper-trunk-jdk8 - Build # 892 - Still Failing
Date Sun, 08 Jan 2017 12:03:32 GMT
See https://builds.apache.org/job/ZooKeeper-trunk-jdk8/892/

###################################################################################
########################## LAST 60 LINES OF THE CONSOLE ###########################
[...truncated 463470 lines...]
    [junit] 2017-01-08 12:01:03,614 [myid:] - INFO  [ProcessThread(sid:0 cport:30317)::PrepRequestProcessor@157]
- PrepRequestProcessor exited loop!
    [junit] 2017-01-08 12:01:03,614 [myid:] - INFO  [SyncThread:0:SyncRequestProcessor@169]
- SyncRequestProcessor exited!
    [junit] 2017-01-08 12:01:03,614 [myid:] - INFO  [main:FinalRequestProcessor@481] - shutdown
of request processor complete
    [junit] 2017-01-08 12:01:03,615 [myid:] - INFO  [main:MBeanRegistry@128] - Unregister
MBean [org.apache.ZooKeeperService:name0=StandaloneServer_port30317,name1=InMemoryDataTree]
    [junit] 2017-01-08 12:01:03,615 [myid:] - INFO  [main:MBeanRegistry@128] - Unregister
MBean [org.apache.ZooKeeperService:name0=StandaloneServer_port30317]
    [junit] 2017-01-08 12:01:03,615 [myid:] - INFO  [main:FourLetterWordMain@85] - connecting
to 127.0.0.1 30317
    [junit] 2017-01-08 12:01:03,615 [myid:] - INFO  [main:JMXEnv@146] - ensureOnly:[]
    [junit] 2017-01-08 12:01:03,619 [myid:] - INFO  [main:ClientBase@568] - fdcount after
test is: 4827 at start it was 4827
    [junit] 2017-01-08 12:01:03,619 [myid:] - INFO  [main:ZKTestCase$1@65] - SUCCEEDED testWatcherAutoResetWithLocal
    [junit] 2017-01-08 12:01:03,619 [myid:] - INFO  [main:ZKTestCase$1@60] - FINISHED testWatcherAutoResetWithLocal
    [junit] Tests run: 101, Failures: 0, Errors: 0, Skipped: 0, Time elapsed: 599.469 sec,
Thread: 8, Class: org.apache.zookeeper.test.NioNettySuiteTest
    [junit] Running org.apache.zookeeper.server.quorum.Zab1_0Test in thread 7
    [junit] Tests run: 1, Failures: 0, Errors: 1, Skipped: 0, Time elapsed: 0 sec, Thread:
7, Class: org.apache.zookeeper.server.quorum.Zab1_0Test
    [junit] Test org.apache.zookeeper.server.quorum.Zab1_0Test FAILED (timeout)
    [junit] 2017-01-08 12:02:54,933 [myid:] - INFO  [main:JUnit4ZKTestRunner$LoggedInvokeMethod@82]
- Memory used 134587
    [junit] 2017-01-08 12:02:54,933 [myid:] - INFO  [main:JUnit4ZKTestRunner$LoggedInvokeMethod@87]
- Number of threads 55
    [junit] 2017-01-08 12:02:54,933 [myid:] - INFO  [main:JUnit4ZKTestRunner$LoggedInvokeMethod@102]
- FINISHED TEST METHOD testManyChildWatchersAutoReset
    [junit] 2017-01-08 12:02:54,934 [myid:] - INFO  [main:ClientBase@543] - tearDown starting
    [junit] 2017-01-08 12:02:54,935 [myid:] - INFO  [ProcessThread(sid:0 cport:11225)::PrepRequestProcessor@618]
- Processed session termination for sessionid: 0x102119f030f0000
    [junit] 2017-01-08 12:02:54,983 [myid:] - INFO  [NIOWorkerThread-14:MBeanRegistry@128]
- Unregister MBean [org.apache.ZooKeeperService:name0=StandaloneServer_port11225,name1=Connections,name2=127.0.0.1,name3=0x102119f030f0000]
    [junit] 2017-01-08 12:02:54,983 [myid:] - INFO  [main:ZooKeeper@1313] - Session: 0x102119f030f0000
closed
    [junit] 2017-01-08 12:02:54,983 [myid:] - INFO  [main-EventThread:ClientCnxn$EventThread@513]
- EventThread shut down for session: 0x102119f030f0000
    [junit] 2017-01-08 12:02:54,983 [myid:] - INFO  [NIOWorkerThread-14:NIOServerCnxn@614]
- Closed socket connection for client /127.0.0.1:53257 which had sessionid 0x102119f030f0000
    [junit] 2017-01-08 12:02:54,984 [myid:] - INFO  [ProcessThread(sid:0 cport:11225)::PrepRequestProcessor@618]
- Processed session termination for sessionid: 0x102119f030f0001
    [junit] 2017-01-08 12:02:55,025 [myid:] - INFO  [main:ZooKeeper@1313] - Session: 0x102119f030f0001
closed
    [junit] 2017-01-08 12:02:55,025 [myid:] - INFO  [main-EventThread:ClientCnxn$EventThread@513]
- EventThread shut down for session: 0x102119f030f0001
    [junit] 2017-01-08 12:02:55,025 [myid:] - INFO  [main:ClientBase@513] - STOPPING server
    [junit] 2017-01-08 12:02:55,025 [myid:] - INFO  [NIOWorkerThread-21:MBeanRegistry@128]
- Unregister MBean [org.apache.ZooKeeperService:name0=StandaloneServer_port11225,name1=Connections,name2=127.0.0.1,name3=0x102119f030f0001]
    [junit] 2017-01-08 12:02:55,027 [myid:] - INFO  [ConnnectionExpirer:NIOServerCnxnFactory$ConnectionExpirerThread@583]
- ConnnectionExpirerThread interrupted
    [junit] 2017-01-08 12:02:55,029 [myid:] - INFO  [NIOWorkerThread-21:NIOServerCnxn@614]
- Closed socket connection for client /127.0.0.1:53227 which had sessionid 0x102119f030f0001
    [junit] 2017-01-08 12:02:55,030 [myid:] - INFO  [NIOServerCxnFactory.AcceptThread:0.0.0.0/0.0.0.0:11225:NIOServerCnxnFactory$AcceptThread@219]
- accept thread exitted run method
    [junit] 2017-01-08 12:02:55,032 [myid:] - INFO  [NIOServerCxnFactory.SelectorThread-0:NIOServerCnxnFactory$SelectorThread@420]
- selector thread exitted run method
    [junit] 2017-01-08 12:02:55,030 [myid:] - INFO  [NIOServerCxnFactory.SelectorThread-1:NIOServerCnxnFactory$SelectorThread@420]
- selector thread exitted run method
    [junit] 2017-01-08 12:02:55,037 [myid:] - INFO  [main:ZooKeeperServer@534] - shutting
down
    [junit] 2017-01-08 12:02:55,037 [myid:] - ERROR [main:ZooKeeperServer@506] - ZKShutdownHandler
is not registered, so ZooKeeper server won't take any action on ERROR or SHUTDOWN server state
changes
    [junit] 2017-01-08 12:02:55,038 [myid:] - INFO  [main:SessionTrackerImpl@232] - Shutting
down
    [junit] 2017-01-08 12:02:55,038 [myid:] - INFO  [main:PrepRequestProcessor@1009] - Shutting
down
    [junit] 2017-01-08 12:02:55,038 [myid:] - INFO  [main:SyncRequestProcessor@191] - Shutting
down
    [junit] 2017-01-08 12:02:55,038 [myid:] - INFO  [ProcessThread(sid:0 cport:11225)::PrepRequestProcessor@157]
- PrepRequestProcessor exited loop!
    [junit] 2017-01-08 12:02:55,038 [myid:] - INFO  [SyncThread:0:SyncRequestProcessor@169]
- SyncRequestProcessor exited!
    [junit] 2017-01-08 12:02:55,039 [myid:] - INFO  [main:FinalRequestProcessor@481] - shutdown
of request processor complete
    [junit] 2017-01-08 12:02:55,039 [myid:] - INFO  [main:MBeanRegistry@128] - Unregister
MBean [org.apache.ZooKeeperService:name0=StandaloneServer_port11225,name1=InMemoryDataTree]
    [junit] 2017-01-08 12:02:55,039 [myid:] - INFO  [main:MBeanRegistry@128] - Unregister
MBean [org.apache.ZooKeeperService:name0=StandaloneServer_port11225]
    [junit] 2017-01-08 12:02:55,040 [myid:] - INFO  [main:FourLetterWordMain@85] - connecting
to 127.0.0.1 11225
    [junit] 2017-01-08 12:02:55,041 [myid:] - INFO  [main:JMXEnv@146] - ensureOnly:[]
    [junit] 2017-01-08 12:02:55,049 [myid:] - INFO  [main:ClientBase@568] - fdcount after
test is: 57 at start it was 57
    [junit] 2017-01-08 12:02:55,049 [myid:] - INFO  [main:ZKTestCase$1@65] - SUCCEEDED testManyChildWatchersAutoReset
    [junit] 2017-01-08 12:02:55,049 [myid:] - INFO  [main:ZKTestCase$1@60] - FINISHED testManyChildWatchersAutoReset
    [junit] Tests run: 4, Failures: 0, Errors: 0, Skipped: 0, Time elapsed: 864.102 sec, Thread:
1, Class: org.apache.zookeeper.test.DisconnectedWatcherTest

BUILD FAILED
/home/jenkins/jenkins-slave/workspace/ZooKeeper-trunk-jdk8/build.xml:1209: Tests failed!

Total time: 18 minutes 46 seconds
Build step 'Invoke Ant' marked build as failure
[WARNINGS] Skipping publisher since build result is FAILURE
Recording test results
Email was triggered for: Failure - Any
Sending email for trigger: Failure - Any



###################################################################################
############################## FAILED TESTS (if any) ##############################
2 tests failed.
FAILED:  org.apache.zookeeper.server.quorum.ReconfigFailureCasesTest.testLeaderTimesoutOnNewQuorum

Error Message:
expected:<[leaderelection]> but was:<[following]>

Stack Trace:
junit.framework.AssertionFailedError: expected:<[leaderelection]> but was:<[following]>
	at org.apache.zookeeper.server.quorum.ReconfigFailureCasesTest.testLeaderTimesoutOnNewQuorum(ReconfigFailureCasesTest.java:197)
	at org.apache.zookeeper.JUnit4ZKTestRunner$LoggedInvokeMethod.evaluate(JUnit4ZKTestRunner.java:79)


FAILED:  org.apache.zookeeper.server.quorum.Zab1_0Test.testNormalObserverRun

Error Message:
Timeout occurred. Please note the time in the report does not reflect the time until the timeout.

Stack Trace:
junit.framework.AssertionFailedError: Timeout occurred. Please note the time in the report
does not reflect the time until the timeout.
	at java.lang.Thread.run(Thread.java:745)



Mime
  • Unnamed multipart/mixed (inline, None, 0 bytes)
View raw message