zookeeper-dev mailing list archives

Site index · List index
Message view « Date » · « Thread »
Top « Date » · « Thread »
From Apache Jenkins Server <jenk...@builds.apache.org>
Subject ZooKeeper_branch34_jdk8 - Build # 835 - Failure
Date Sun, 08 Jan 2017 23:25:22 GMT
See https://builds.apache.org/job/ZooKeeper_branch34_jdk8/835/

###################################################################################
########################## LAST 60 LINES OF THE CONSOLE ###########################
[...truncated 242419 lines...]
    [junit] 2017-01-08 23:22:56,425 [myid:] - INFO  [main:ClientBase@445] - STARTING server
    [junit] 2017-01-08 23:22:56,426 [myid:] - INFO  [main:ClientBase@366] - CREATING server
instance 127.0.0.1:11221
    [junit] 2017-01-08 23:22:56,426 [myid:] - INFO  [main:NIOServerCnxnFactory@89] - binding
to port 0.0.0.0/0.0.0.0:11221
    [junit] 2017-01-08 23:22:56,426 [myid:] - INFO  [main:ClientBase@341] - STARTING server
instance 127.0.0.1:11221
    [junit] 2017-01-08 23:22:56,426 [myid:] - INFO  [main:ZooKeeperServer@173] - Created server
with tickTime 3000 minSessionTimeout 6000 maxSessionTimeout 60000 datadir /home/jenkins/jenkins-slave/workspace/ZooKeeper_branch34_jdk8/build/test/tmp/test5334081062004055412.junit.dir/version-2
snapdir /home/jenkins/jenkins-slave/workspace/ZooKeeper_branch34_jdk8/build/test/tmp/test5334081062004055412.junit.dir/version-2
    [junit] 2017-01-08 23:22:56,430 [myid:] - ERROR [main:ZooKeeperServer@472] - ZKShutdownHandler
is not registered, so ZooKeeper server won't take any action on ERROR or SHUTDOWN server state
changes
    [junit] 2017-01-08 23:22:56,430 [myid:] - INFO  [main:FourLetterWordMain@62] - connecting
to 127.0.0.1 11221
    [junit] 2017-01-08 23:22:56,430 [myid:] - INFO  [NIOServerCxn.Factory:0.0.0.0/0.0.0.0:11221:NIOServerCnxnFactory@192]
- Accepted socket connection from /127.0.0.1:50887
    [junit] 2017-01-08 23:22:56,431 [myid:] - INFO  [NIOServerCxn.Factory:0.0.0.0/0.0.0.0:11221:NIOServerCnxn@827]
- Processing stat command from /127.0.0.1:50887
    [junit] 2017-01-08 23:22:56,431 [myid:] - INFO  [Thread-4:NIOServerCnxn$StatCommand@663]
- Stat command output
    [junit] 2017-01-08 23:22:56,431 [myid:] - INFO  [Thread-4:NIOServerCnxn@1008] - Closed
socket connection for client /127.0.0.1:50887 (no session established for client)
    [junit] 2017-01-08 23:22:56,432 [myid:] - INFO  [main:JMXEnv@230] - ensureParent:[InMemoryDataTree,
StandaloneServer_port]
    [junit] 2017-01-08 23:22:56,433 [myid:] - INFO  [main:JMXEnv@247] - expect:InMemoryDataTree
    [junit] 2017-01-08 23:22:56,434 [myid:] - INFO  [main:JMXEnv@251] - found:InMemoryDataTree
org.apache.ZooKeeperService:name0=StandaloneServer_port11221,name1=InMemoryDataTree
    [junit] 2017-01-08 23:22:56,434 [myid:] - INFO  [main:JMXEnv@247] - expect:StandaloneServer_port
    [junit] 2017-01-08 23:22:56,434 [myid:] - INFO  [main:JMXEnv@251] - found:StandaloneServer_port
org.apache.ZooKeeperService:name0=StandaloneServer_port11221
    [junit] 2017-01-08 23:22:56,434 [myid:] - INFO  [main:JUnit4ZKTestRunner$LoggedInvokeMethod@58]
- Memory used 33644
    [junit] 2017-01-08 23:22:56,435 [myid:] - INFO  [main:JUnit4ZKTestRunner$LoggedInvokeMethod@63]
- Number of threads 20
    [junit] 2017-01-08 23:22:56,435 [myid:] - INFO  [main:JUnit4ZKTestRunner$LoggedInvokeMethod@78]
- FINISHED TEST METHOD testQuota
    [junit] 2017-01-08 23:22:56,435 [myid:] - INFO  [main:ClientBase@522] - tearDown starting
    [junit] 2017-01-08 23:22:57,000 [myid:] - INFO  [SessionTracker:SessionTrackerImpl@162]
- SessionTrackerImpl exited loop!
    [junit] 2017-01-08 23:22:57,000 [myid:] - INFO  [SessionTracker:SessionTrackerImpl@162]
- SessionTrackerImpl exited loop!
    [junit] 2017-01-08 23:22:57,381 [myid:] - INFO  [main-SendThread(127.0.0.1:11221):ClientCnxn$SendThread@1032]
- Opening socket connection to server 127.0.0.1/127.0.0.1:11221. Will not attempt to authenticate
using SASL (unknown error)
    [junit] 2017-01-08 23:22:57,382 [myid:] - INFO  [main-SendThread(127.0.0.1:11221):ClientCnxn$SendThread@876]
- Socket connection established to 127.0.0.1/127.0.0.1:11221, initiating session
    [junit] 2017-01-08 23:22:57,382 [myid:] - INFO  [NIOServerCxn.Factory:0.0.0.0/0.0.0.0:11221:NIOServerCnxnFactory@192]
- Accepted socket connection from /127.0.0.1:50922
    [junit] 2017-01-08 23:22:57,383 [myid:] - INFO  [NIOServerCxn.Factory:0.0.0.0/0.0.0.0:11221:ZooKeeperServer@921]
- Client attempting to renew session 0x1598064538e0000 at /127.0.0.1:50922
    [junit] 2017-01-08 23:22:57,383 [myid:] - INFO  [NIOServerCxn.Factory:0.0.0.0/0.0.0.0:11221:ZooKeeperServer@673]
- Established session 0x1598064538e0000 with negotiated timeout 30000 for client /127.0.0.1:50922
    [junit] 2017-01-08 23:22:57,384 [myid:] - INFO  [main-SendThread(127.0.0.1:11221):ClientCnxn$SendThread@1299]
- Session establishment complete on server 127.0.0.1/127.0.0.1:11221, sessionid = 0x1598064538e0000,
negotiated timeout = 30000
    [junit] 2017-01-08 23:22:57,385 [myid:] - INFO  [ProcessThread(sid:0 cport:11221)::PrepRequestProcessor@487]
- Processed session termination for sessionid: 0x1598064538e0000
    [junit] 2017-01-08 23:22:57,385 [myid:] - INFO  [SyncThread:0:FileTxnLog@203] - Creating
new log file: log.c
    [junit] 2017-01-08 23:22:57,425 [myid:] - INFO  [main:ZooKeeper@684] - Session: 0x1598064538e0000
closed
    [junit] 2017-01-08 23:22:57,426 [myid:] - INFO  [main:ClientBase@492] - STOPPING server
    [junit] 2017-01-08 23:22:57,428 [myid:] - INFO  [main-EventThread:ClientCnxn$EventThread@519]
- EventThread shut down for session: 0x1598064538e0000
    [junit] 2017-01-08 23:22:57,429 [myid:] - INFO  [NIOServerCxn.Factory:0.0.0.0/0.0.0.0:11221:NIOServerCnxn@1008]
- Closed socket connection for client /127.0.0.1:50922 which had sessionid 0x1598064538e0000
    [junit] 2017-01-08 23:22:57,429 [myid:] - INFO  [NIOServerCxn.Factory:0.0.0.0/0.0.0.0:11221:NIOServerCnxnFactory@219]
- NIOServerCnxn factory exited run method
    [junit] 2017-01-08 23:22:57,429 [myid:] - INFO  [main:ZooKeeperServer@497] - shutting
down
    [junit] 2017-01-08 23:22:57,429 [myid:] - ERROR [main:ZooKeeperServer@472] - ZKShutdownHandler
is not registered, so ZooKeeper server won't take any action on ERROR or SHUTDOWN server state
changes
    [junit] 2017-01-08 23:22:57,430 [myid:] - INFO  [main:SessionTrackerImpl@225] - Shutting
down
    [junit] 2017-01-08 23:22:57,430 [myid:] - INFO  [main:PrepRequestProcessor@765] - Shutting
down
    [junit] 2017-01-08 23:22:57,430 [myid:] - INFO  [main:SyncRequestProcessor@208] - Shutting
down
    [junit] 2017-01-08 23:22:57,431 [myid:] - INFO  [ProcessThread(sid:0 cport:11221)::PrepRequestProcessor@143]
- PrepRequestProcessor exited loop!
    [junit] 2017-01-08 23:22:57,431 [myid:] - INFO  [SyncThread:0:SyncRequestProcessor@186]
- SyncRequestProcessor exited!
    [junit] 2017-01-08 23:22:57,431 [myid:] - INFO  [main:FinalRequestProcessor@402] - shutdown
of request processor complete
    [junit] 2017-01-08 23:22:57,432 [myid:] - INFO  [main:FourLetterWordMain@62] - connecting
to 127.0.0.1 11221
    [junit] 2017-01-08 23:22:57,432 [myid:] - INFO  [main:JMXEnv@147] - ensureOnly:[]
    [junit] 2017-01-08 23:22:57,442 [myid:] - INFO  [main:ClientBase@547] - fdcount after
test is: 57 at start it was 41
    [junit] 2017-01-08 23:22:57,443 [myid:] - INFO  [main:ClientBase@549] - sleeping for 20
secs
    [junit] 2017-01-08 23:22:57,443 [myid:] - INFO  [main:ZKTestCase$1@65] - SUCCEEDED testQuota
    [junit] 2017-01-08 23:22:57,444 [myid:] - INFO  [main:ZKTestCase$1@60] - FINISHED testQuota
    [junit] Tests run: 1, Failures: 0, Errors: 0, Skipped: 0, Time elapsed: 2.291 sec

BUILD FAILED
/home/jenkins/jenkins-slave/workspace/ZooKeeper_branch34_jdk8/build.xml:1325: Tests failed!

Total time: 55 minutes 26 seconds
Build step 'Invoke Ant' marked build as failure
Recording test results
Email was triggered for: Failure - Any
Sending email for trigger: Failure - Any



###################################################################################
############################## FAILED TESTS (if any) ##############################
1 tests failed.
FAILED:  org.apache.zookeeper.test.QuorumTest.testLeaderShutdown

Error Message:
Forked Java VM exited abnormally. Please note the time in the report does not reflect the
time until the VM exit.

Stack Trace:
junit.framework.AssertionFailedError: Forked Java VM exited abnormally. Please note the time
in the report does not reflect the time until the VM exit.



Mime
  • Unnamed multipart/mixed (inline, None, 0 bytes)
View raw message