zookeeper-dev mailing list archives

Site index · List index
Message view « Date » · « Thread »
Top « Date » · « Thread »
From Apache Jenkins Server <jenk...@builds.apache.org>
Subject ZooKeeper-trunk-solaris - Build # 1464 - Still Failing
Date Fri, 13 Jan 2017 07:21:47 GMT
See https://builds.apache.org/job/ZooKeeper-trunk-solaris/1464/

###################################################################################
########################## LAST 60 LINES OF THE CONSOLE ###########################
[...truncated 9134 lines...]
    [junit] 2017-01-13 07:23:23,926 [myid:] - INFO  [main:JUnit4ZKTestRunner$LoggedInvokeMethod@87]
- Number of threads 64
    [junit] 2017-01-13 07:23:23,926 [myid:] - INFO  [main:JUnit4ZKTestRunner$LoggedInvokeMethod@102]
- FINISHED TEST METHOD testDeleteRecursive
    [junit] 2017-01-13 07:23:23,927 [myid:] - INFO  [main:ClientBase@543] - tearDown starting
    [junit] 2017-01-13 07:23:23,927 [myid:] - INFO  [ProcessThread(sid:0 cport:11251)::PrepRequestProcessor@618]
- Processed session termination for sessionid: 0x12613af194b0000
    [junit] 2017-01-13 07:23:23,928 [myid:] - INFO  [main:ZooKeeper@1324] - Session: 0x12613af194b0000
closed
    [junit] 2017-01-13 07:23:23,928 [myid:] - INFO  [NIOWorkerThread-1:MBeanRegistry@128]
- Unregister MBean [org.apache.ZooKeeperService:name0=StandaloneServer_port11251,name1=Connections,name2=127.0.0.1,name3=0x12613af194b0000]
    [junit] 2017-01-13 07:23:23,928 [myid:] - INFO  [main:ClientBase@513] - STOPPING server
    [junit] 2017-01-13 07:23:23,928 [myid:] - INFO  [main-EventThread:ClientCnxn$EventThread@513]
- EventThread shut down for session: 0x12613af194b0000
    [junit] 2017-01-13 07:23:23,928 [myid:] - INFO  [ConnnectionExpirer:NIOServerCnxnFactory$ConnectionExpirerThread@583]
- ConnnectionExpirerThread interrupted
    [junit] 2017-01-13 07:23:23,928 [myid:] - INFO  [NIOWorkerThread-1:NIOServerCnxn@614]
- Closed socket connection for client /127.0.0.1:52344 which had sessionid 0x12613af194b0000
    [junit] 2017-01-13 07:23:23,930 [myid:] - INFO  [NIOServerCxnFactory.SelectorThread-0:NIOServerCnxnFactory$SelectorThread@420]
- selector thread exitted run method
    [junit] 2017-01-13 07:23:23,929 [myid:] - INFO  [NIOServerCxnFactory.AcceptThread:0.0.0.0/0.0.0.0:11251:NIOServerCnxnFactory$AcceptThread@219]
- accept thread exitted run method
    [junit] 2017-01-13 07:23:23,930 [myid:] - INFO  [NIOServerCxnFactory.SelectorThread-1:NIOServerCnxnFactory$SelectorThread@420]
- selector thread exitted run method
    [junit] 2017-01-13 07:23:23,930 [myid:] - INFO  [main:ZooKeeperServer@534] - shutting
down
    [junit] 2017-01-13 07:23:23,931 [myid:] - ERROR [main:ZooKeeperServer@506] - ZKShutdownHandler
is not registered, so ZooKeeper server won't take any action on ERROR or SHUTDOWN server state
changes
    [junit] 2017-01-13 07:23:23,931 [myid:] - INFO  [main:SessionTrackerImpl@232] - Shutting
down
    [junit] 2017-01-13 07:23:23,931 [myid:] - INFO  [main:PrepRequestProcessor@1009] - Shutting
down
    [junit] 2017-01-13 07:23:23,931 [myid:] - INFO  [main:SyncRequestProcessor@191] - Shutting
down
    [junit] 2017-01-13 07:23:23,931 [myid:] - INFO  [ProcessThread(sid:0 cport:11251)::PrepRequestProcessor@157]
- PrepRequestProcessor exited loop!
    [junit] 2017-01-13 07:23:23,931 [myid:] - INFO  [SyncThread:0:SyncRequestProcessor@169]
- SyncRequestProcessor exited!
    [junit] 2017-01-13 07:23:23,931 [myid:] - INFO  [main:FinalRequestProcessor@481] - shutdown
of request processor complete
    [junit] 2017-01-13 07:23:23,932 [myid:] - INFO  [main:MBeanRegistry@128] - Unregister
MBean [org.apache.ZooKeeperService:name0=StandaloneServer_port11251,name1=InMemoryDataTree]
    [junit] 2017-01-13 07:23:23,932 [myid:] - INFO  [main:MBeanRegistry@128] - Unregister
MBean [org.apache.ZooKeeperService:name0=StandaloneServer_port11251]
    [junit] 2017-01-13 07:23:23,932 [myid:] - INFO  [main:FourLetterWordMain@85] - connecting
to 127.0.0.1 11251
    [junit] 2017-01-13 07:23:23,932 [myid:] - INFO  [main:JMXEnv@146] - ensureOnly:[]
    [junit] 2017-01-13 07:23:23,935 [myid:] - INFO  [main:ClientBase@568] - fdcount after
test is: 74 at start it was 74
    [junit] 2017-01-13 07:23:23,935 [myid:] - INFO  [main:ZKTestCase$1@65] - SUCCEEDED testDeleteRecursive
    [junit] 2017-01-13 07:23:23,935 [myid:] - INFO  [main:ZKTestCase$1@60] - FINISHED testDeleteRecursive
    [junit] The command 'rmr' has been deprecated. Please use 'deleteall' instead.
    [junit] Tests run: 30, Failures: 0, Errors: 0, Time elapsed: 13.685 sec
    [junit] 2017-01-13 07:23:24,261 [myid:] - INFO  [SessionTracker:SessionTrackerImpl@158]
- SessionTrackerImpl exited loop!
    [junit] 2017-01-13 07:23:24,261 [myid:] - INFO  [SessionTracker:SessionTrackerImpl@158]
- SessionTrackerImpl exited loop!
    [junit] 2017-01-13 07:23:24,261 [myid:] - INFO  [SessionTracker:SessionTrackerImpl@158]
- SessionTrackerImpl exited loop!
    [junit] 2017-01-13 07:23:24,261 [myid:] - INFO  [SessionTracker:SessionTrackerImpl@158]
- SessionTrackerImpl exited loop!
    [junit] 2017-01-13 07:23:24,261 [myid:] - INFO  [SessionTracker:SessionTrackerImpl@158]
- SessionTrackerImpl exited loop!
    [junit] 2017-01-13 07:23:24,261 [myid:] - INFO  [SessionTracker:SessionTrackerImpl@158]
- SessionTrackerImpl exited loop!
    [junit] 2017-01-13 07:23:24,261 [myid:] - INFO  [SessionTracker:SessionTrackerImpl@158]
- SessionTrackerImpl exited loop!
    [junit] 2017-01-13 07:23:24,261 [myid:] - INFO  [SessionTracker:SessionTrackerImpl@158]
- SessionTrackerImpl exited loop!
    [junit] 2017-01-13 07:23:24,261 [myid:] - INFO  [SessionTracker:SessionTrackerImpl@158]
- SessionTrackerImpl exited loop!
    [junit] 2017-01-13 07:23:24,261 [myid:] - INFO  [SessionTracker:SessionTrackerImpl@158]
- SessionTrackerImpl exited loop!
    [junit] 2017-01-13 07:23:24,261 [myid:] - INFO  [SessionTracker:SessionTrackerImpl@158]
- SessionTrackerImpl exited loop!
    [junit] 2017-01-13 07:23:24,261 [myid:] - INFO  [SessionTracker:SessionTrackerImpl@158]
- SessionTrackerImpl exited loop!
    [junit] 2017-01-13 07:23:24,261 [myid:] - INFO  [SessionTracker:SessionTrackerImpl@158]
- SessionTrackerImpl exited loop!
    [junit] 2017-01-13 07:23:24,261 [myid:] - INFO  [SessionTracker:SessionTrackerImpl@158]
- SessionTrackerImpl exited loop!
    [junit] 2017-01-13 07:23:24,261 [myid:] - INFO  [SessionTracker:SessionTrackerImpl@158]
- SessionTrackerImpl exited loop!
    [junit] 2017-01-13 07:23:24,261 [myid:] - INFO  [SessionTracker:SessionTrackerImpl@158]
- SessionTrackerImpl exited loop!
    [junit] Running org.apache.zookeeper.ZooKeeperTestableTest
    [junit] Tests run: 1, Failures: 0, Errors: 1, Time elapsed: 0 sec

BUILD FAILED
/zonestorage/hudson_solaris/home/hudson/hudson-slave/workspace/ZooKeeper-trunk-solaris/build.xml:1223:
Process fork failed.

Total time: 6 minutes 0 seconds
Build step 'Invoke Ant' marked build as failure
[locks-and-latches] Releasing all the locks
[locks-and-latches] All the locks released
Recording test results
Email was triggered for: Failure - Any
Sending email for trigger: Failure - Any



###################################################################################
############################## FAILED TESTS (if any) ##############################
1 tests failed.
FAILED:  org.apache.zookeeper.ZooKeeperTestableTest.unknown

Error Message:
Forked Java VM exited abnormally. Please note the time in the report does not reflect the
time until the VM exit.

Stack Trace:
junit.framework.AssertionFailedError: Forked Java VM exited abnormally. Please note the time
in the report does not reflect the time until the VM exit.



Mime
  • Unnamed multipart/mixed (inline, None, 0 bytes)
View raw message