zookeeper-dev mailing list archives

Site index · List index
Message view « Date » · « Thread »
Top « Date » · « Thread »
From Apache Jenkins Server <jenk...@builds.apache.org>
Subject ZooKeeper-trunk-jdk8 - Build # 914 - Still Failing
Date Wed, 25 Jan 2017 13:39:17 GMT
See https://builds.apache.org/job/ZooKeeper-trunk-jdk8/914/

###################################################################################
########################## LAST 60 LINES OF THE CONSOLE ###########################
[...truncated 459054 lines...]
    [junit] 2017-01-25 13:38:12,379 [myid:] - INFO  [main:ClientBase@583] - fdcount after
test is: 4830 at start it was 4830
    [junit] 2017-01-25 13:38:12,379 [myid:] - INFO  [main:ZKTestCase$1@65] - SUCCEEDED testWatcherAutoResetWithLocal
    [junit] 2017-01-25 13:38:12,379 [myid:] - INFO  [main:ZKTestCase$1@60] - FINISHED testWatcherAutoResetWithLocal
    [junit] Tests run: 103, Failures: 0, Errors: 0, Skipped: 0, Time elapsed: 567.837 sec,
Thread: 8, Class: org.apache.zookeeper.test.NioNettySuiteTest
    [junit] 2017-01-25 13:38:12,562 [myid:127.0.0.1:30073] - INFO  [main-SendThread(127.0.0.1:30073):ClientCnxn$SendThread@1113]
- Opening socket connection to server 127.0.0.1/127.0.0.1:30073. Will not attempt to authenticate
using SASL (unknown error)
    [junit] 2017-01-25 13:38:12,562 [myid:127.0.0.1:30073] - WARN  [main-SendThread(127.0.0.1:30073):ClientCnxn$SendThread@1235]
- Session 0x1026986398c0000 for server 127.0.0.1/127.0.0.1:30073, unexpected error, closing
socket connection and attempting reconnect
    [junit] java.net.ConnectException: Connection refused
    [junit] 	at sun.nio.ch.SocketChannelImpl.checkConnect(Native Method)
    [junit] 	at sun.nio.ch.SocketChannelImpl.finishConnect(SocketChannelImpl.java:717)
    [junit] 	at org.apache.zookeeper.ClientCnxnSocketNIO.doTransport(ClientCnxnSocketNIO.java:357)
    [junit] 	at org.apache.zookeeper.ClientCnxn$SendThread.run(ClientCnxn.java:1214)
    [junit] 2017-01-25 13:39:12,005 [myid:] - INFO  [main:JUnit4ZKTestRunner$LoggedInvokeMethod@82]
- Memory used 134017
    [junit] 2017-01-25 13:39:12,006 [myid:] - INFO  [main:JUnit4ZKTestRunner$LoggedInvokeMethod@87]
- Number of threads 55
    [junit] 2017-01-25 13:39:12,006 [myid:] - INFO  [main:JUnit4ZKTestRunner$LoggedInvokeMethod@102]
- FINISHED TEST METHOD testManyChildWatchersAutoReset
    [junit] 2017-01-25 13:39:12,006 [myid:] - INFO  [main:ClientBase@558] - tearDown starting
    [junit] 2017-01-25 13:39:12,008 [myid:] - INFO  [ProcessThread(sid:0 cport:24690)::PrepRequestProcessor@618]
- Processed session termination for sessionid: 0x1026983c5370000
    [junit] 2017-01-25 13:39:12,057 [myid:] - INFO  [main:ZooKeeper@1324] - Session: 0x1026983c5370000
closed
    [junit] 2017-01-25 13:39:12,057 [myid:] - INFO  [main-EventThread:ClientCnxn$EventThread@513]
- EventThread shut down for session: 0x1026983c5370000
    [junit] 2017-01-25 13:39:12,057 [myid:] - INFO  [NIOWorkerThread-1:MBeanRegistry@128]
- Unregister MBean [org.apache.ZooKeeperService:name0=StandaloneServer_port24690,name1=Connections,name2=127.0.0.1,name3=0x1026983c5370000]
    [junit] 2017-01-25 13:39:12,058 [myid:] - INFO  [ProcessThread(sid:0 cport:24690)::PrepRequestProcessor@618]
- Processed session termination for sessionid: 0x1026983c5370001
    [junit] 2017-01-25 13:39:12,058 [myid:] - INFO  [NIOWorkerThread-1:NIOServerCnxn@614]
- Closed socket connection for client /127.0.0.1:38572 which had sessionid 0x1026983c5370000
    [junit] 2017-01-25 13:39:12,081 [myid:] - INFO  [main:ZooKeeper@1324] - Session: 0x1026983c5370001
closed
    [junit] 2017-01-25 13:39:12,081 [myid:] - INFO  [NIOWorkerThread-27:MBeanRegistry@128]
- Unregister MBean [org.apache.ZooKeeperService:name0=StandaloneServer_port24690,name1=Connections,name2=127.0.0.1,name3=0x1026983c5370001]
    [junit] 2017-01-25 13:39:12,081 [myid:] - INFO  [main:ClientBase@528] - STOPPING server
    [junit] 2017-01-25 13:39:12,081 [myid:] - INFO  [main-EventThread:ClientCnxn$EventThread@513]
- EventThread shut down for session: 0x1026983c5370001
    [junit] 2017-01-25 13:39:12,081 [myid:] - INFO  [NIOWorkerThread-27:NIOServerCnxn@614]
- Closed socket connection for client /127.0.0.1:38563 which had sessionid 0x1026983c5370001
    [junit] 2017-01-25 13:39:12,083 [myid:] - INFO  [ConnnectionExpirer:NIOServerCnxnFactory$ConnectionExpirerThread@583]
- ConnnectionExpirerThread interrupted
    [junit] 2017-01-25 13:39:12,085 [myid:] - INFO  [NIOServerCxnFactory.AcceptThread:0.0.0.0/0.0.0.0:24690:NIOServerCnxnFactory$AcceptThread@219]
- accept thread exitted run method
    [junit] 2017-01-25 13:39:12,088 [myid:] - INFO  [NIOServerCxnFactory.SelectorThread-1:NIOServerCnxnFactory$SelectorThread@420]
- selector thread exitted run method
    [junit] 2017-01-25 13:39:12,088 [myid:] - INFO  [NIOServerCxnFactory.SelectorThread-0:NIOServerCnxnFactory$SelectorThread@420]
- selector thread exitted run method
    [junit] 2017-01-25 13:39:12,090 [myid:] - INFO  [main:ZooKeeperServer@534] - shutting
down
    [junit] 2017-01-25 13:39:12,091 [myid:] - ERROR [main:ZooKeeperServer@506] - ZKShutdownHandler
is not registered, so ZooKeeper server won't take any action on ERROR or SHUTDOWN server state
changes
    [junit] 2017-01-25 13:39:12,091 [myid:] - INFO  [main:SessionTrackerImpl@232] - Shutting
down
    [junit] 2017-01-25 13:39:12,091 [myid:] - INFO  [main:PrepRequestProcessor@1009] - Shutting
down
    [junit] 2017-01-25 13:39:12,091 [myid:] - INFO  [main:SyncRequestProcessor@191] - Shutting
down
    [junit] 2017-01-25 13:39:12,091 [myid:] - INFO  [ProcessThread(sid:0 cport:24690)::PrepRequestProcessor@157]
- PrepRequestProcessor exited loop!
    [junit] 2017-01-25 13:39:12,091 [myid:] - INFO  [SyncThread:0:SyncRequestProcessor@169]
- SyncRequestProcessor exited!
    [junit] 2017-01-25 13:39:12,092 [myid:] - INFO  [main:FinalRequestProcessor@481] - shutdown
of request processor complete
    [junit] 2017-01-25 13:39:12,093 [myid:] - INFO  [main:MBeanRegistry@128] - Unregister
MBean [org.apache.ZooKeeperService:name0=StandaloneServer_port24690,name1=InMemoryDataTree]
    [junit] 2017-01-25 13:39:12,093 [myid:] - INFO  [main:MBeanRegistry@128] - Unregister
MBean [org.apache.ZooKeeperService:name0=StandaloneServer_port24690]
    [junit] 2017-01-25 13:39:12,094 [myid:] - INFO  [main:FourLetterWordMain@85] - connecting
to 127.0.0.1 24690
    [junit] 2017-01-25 13:39:12,095 [myid:] - INFO  [main:JMXEnv@146] - ensureOnly:[]
    [junit] 2017-01-25 13:39:12,143 [myid:] - INFO  [main:ClientBase@583] - fdcount after
test is: 57 at start it was 57
    [junit] 2017-01-25 13:39:12,143 [myid:] - INFO  [main:ZKTestCase$1@65] - SUCCEEDED testManyChildWatchersAutoReset
    [junit] 2017-01-25 13:39:12,143 [myid:] - INFO  [main:ZKTestCase$1@60] - FINISHED testManyChildWatchersAutoReset
    [junit] Tests run: 4, Failures: 0, Errors: 0, Skipped: 0, Time elapsed: 795.949 sec, Thread:
6, Class: org.apache.zookeeper.test.DisconnectedWatcherTest
    [junit] Running org.apache.zookeeper.server.quorum.Zab1_0Test in thread 5
    [junit] Tests run: 1, Failures: 0, Errors: 1, Skipped: 0, Time elapsed: 0 sec, Thread:
5, Class: org.apache.zookeeper.server.quorum.Zab1_0Test
    [junit] Test org.apache.zookeeper.server.quorum.Zab1_0Test FAILED (timeout)

BUILD FAILED
/home/jenkins/jenkins-slave/workspace/ZooKeeper-trunk-jdk8/build.xml:1211: Tests failed!

Total time: 17 minutes 18 seconds
Build step 'Invoke Ant' marked build as failure
[WARNINGS] Skipping publisher since build result is FAILURE
Recording test results
Email was triggered for: Failure - Any
Sending email for trigger: Failure - Any



###################################################################################
############################## FAILED TESTS (if any) ##############################
2 tests failed.
FAILED:  org.apache.zookeeper.server.quorum.Zab1_0Test.testNormalObserverRun

Error Message:
Timeout occurred. Please note the time in the report does not reflect the time until the timeout.

Stack Trace:
junit.framework.AssertionFailedError: Timeout occurred. Please note the time in the report
does not reflect the time until the timeout.
	at java.lang.Thread.run(Thread.java:745)


FAILED:  org.apache.zookeeper.test.WatcherTest.testWatchAutoResetWithPending

Error Message:
For 53 expected:<1> but was:<0>

Stack Trace:
junit.framework.AssertionFailedError: For 53 expected:<1> but was:<0>
	at org.apache.zookeeper.test.WatcherTest.testWatchAutoResetWithPending(WatcherTest.java:215)
	at org.apache.zookeeper.JUnit4ZKTestRunner$LoggedInvokeMethod.evaluate(JUnit4ZKTestRunner.java:79)



Mime
  • Unnamed multipart/mixed (inline, None, 0 bytes)
View raw message