zookeeper-dev mailing list archives

Site index · List index
Message view « Date » · « Thread »
Top « Date » · « Thread »
From Apache Jenkins Server <jenk...@builds.apache.org>
Subject ZooKeeper_branch35_jdk8 - Build # 392 - Still Failing
Date Thu, 26 Jan 2017 12:16:02 GMT
See https://builds.apache.org/job/ZooKeeper_branch35_jdk8/392/

###################################################################################
########################## LAST 60 LINES OF THE CONSOLE ###########################
[...truncated 437582 lines...]
    [junit] 	at org.apache.zookeeper.ClientCnxnSocketNIO.doTransport(ClientCnxnSocketNIO.java:357)
    [junit] 	at org.apache.zookeeper.ClientCnxn$SendThread.run(ClientCnxn.java:1214)
    [junit] 2017-01-26 12:15:57,545 [myid:127.0.0.1:11348] - INFO  [main-SendThread(127.0.0.1:11348):ClientCnxn$SendThread@1113]
- Opening socket connection to server 127.0.0.1/127.0.0.1:11348. Will not attempt to authenticate
using SASL (unknown error)
    [junit] 2017-01-26 12:15:57,545 [myid:127.0.0.1:11348] - WARN  [main-SendThread(127.0.0.1:11348):ClientCnxn$SendThread@1235]
- Session 0x202057b70ce0000 for server 127.0.0.1/127.0.0.1:11348, unexpected error, closing
socket connection and attempting reconnect
    [junit] java.net.ConnectException: Connection refused
    [junit] 	at sun.nio.ch.SocketChannelImpl.checkConnect(Native Method)
    [junit] 	at sun.nio.ch.SocketChannelImpl.finishConnect(SocketChannelImpl.java:717)
    [junit] 	at org.apache.zookeeper.ClientCnxnSocketNIO.doTransport(ClientCnxnSocketNIO.java:357)
    [junit] 	at org.apache.zookeeper.ClientCnxn$SendThread.run(ClientCnxn.java:1214)
    [junit] 2017-01-26 12:15:57,650 [myid:127.0.0.1:11345] - INFO  [main-SendThread(127.0.0.1:11345):ClientCnxn$SendThread@1113]
- Opening socket connection to server 127.0.0.1/127.0.0.1:11345. Will not attempt to authenticate
using SASL (unknown error)
    [junit] 2017-01-26 12:15:57,651 [myid:127.0.0.1:11345] - WARN  [main-SendThread(127.0.0.1:11345):ClientCnxn$SendThread@1235]
- Session 0x102057b70c90000 for server 127.0.0.1/127.0.0.1:11345, unexpected error, closing
socket connection and attempting reconnect
    [junit] java.net.ConnectException: Connection refused
    [junit] 	at sun.nio.ch.SocketChannelImpl.checkConnect(Native Method)
    [junit] 	at sun.nio.ch.SocketChannelImpl.finishConnect(SocketChannelImpl.java:717)
    [junit] 	at org.apache.zookeeper.ClientCnxnSocketNIO.doTransport(ClientCnxnSocketNIO.java:357)
    [junit] 	at org.apache.zookeeper.ClientCnxn$SendThread.run(ClientCnxn.java:1214)
    [junit] 2017-01-26 12:15:57,853 [myid:127.0.0.1:11222] - INFO  [main-SendThread(127.0.0.1:11222):ClientCnxn$SendThread@1113]
- Opening socket connection to server 127.0.0.1/127.0.0.1:11222. Will not attempt to authenticate
using SASL (unknown error)
    [junit] 2017-01-26 12:15:57,853 [myid:127.0.0.1:11222] - WARN  [main-SendThread(127.0.0.1:11222):ClientCnxn$SendThread@1235]
- Session 0x10205779eaf0000 for server 127.0.0.1/127.0.0.1:11222, unexpected error, closing
socket connection and attempting reconnect
    [junit] java.net.ConnectException: Connection refused
    [junit] 	at sun.nio.ch.SocketChannelImpl.checkConnect(Native Method)
    [junit] 	at sun.nio.ch.SocketChannelImpl.finishConnect(SocketChannelImpl.java:717)
    [junit] 	at org.apache.zookeeper.ClientCnxnSocketNIO.doTransport(ClientCnxnSocketNIO.java:357)
    [junit] 	at org.apache.zookeeper.ClientCnxn$SendThread.run(ClientCnxn.java:1214)
    [junit] 2017-01-26 12:15:58,077 [myid:] - INFO  [ProcessThread(sid:0 cport:11468)::PrepRequestProcessor@656]
- Processed session termination for sessionid: 0x102057ecd120000
    [junit] 2017-01-26 12:15:58,090 [myid:] - INFO  [main:ZooKeeper@1322] - Session: 0x102057ecd120000
closed
    [junit] 2017-01-26 12:15:58,090 [myid:] - INFO  [main-EventThread:ClientCnxn$EventThread@513]
- EventThread shut down for session: 0x102057ecd120000
    [junit] 2017-01-26 12:15:58,090 [myid:] - INFO  [main:JUnit4ZKTestRunner$LoggedInvokeMethod@82]
- Memory used 214901
    [junit] 2017-01-26 12:15:58,091 [myid:] - INFO  [main:JUnit4ZKTestRunner$LoggedInvokeMethod@87]
- Number of threads 2427
    [junit] 2017-01-26 12:15:58,091 [myid:] - INFO  [main:JUnit4ZKTestRunner$LoggedInvokeMethod@102]
- FINISHED TEST METHOD testWatcherAutoResetWithLocal
    [junit] 2017-01-26 12:15:58,091 [myid:] - INFO  [main:ClientBase@543] - tearDown starting
    [junit] 2017-01-26 12:15:58,091 [myid:] - INFO  [main:ClientBase@513] - STOPPING server
    [junit] 2017-01-26 12:15:58,091 [myid:] - INFO  [main:NettyServerCnxnFactory@464] - shutdown
called 0.0.0.0/0.0.0.0:11468
    [junit] 2017-01-26 12:15:58,090 [myid:] - INFO  [SyncThread:0:MBeanRegistry@128] - Unregister
MBean [org.apache.ZooKeeperService:name0=StandaloneServer_port11468,name1=Connections,name2=127.0.0.1,name3=0x102057ecd120000]
    [junit] 2017-01-26 12:15:58,100 [myid:] - INFO  [main:ZooKeeperServer@533] - shutting
down
    [junit] 2017-01-26 12:15:58,101 [myid:] - ERROR [main:ZooKeeperServer@505] - ZKShutdownHandler
is not registered, so ZooKeeper server won't take any action on ERROR or SHUTDOWN server state
changes
    [junit] 2017-01-26 12:15:58,101 [myid:] - INFO  [main:SessionTrackerImpl@232] - Shutting
down
    [junit] 2017-01-26 12:15:58,101 [myid:] - INFO  [main:PrepRequestProcessor@974] - Shutting
down
    [junit] 2017-01-26 12:15:58,101 [myid:] - INFO  [main:SyncRequestProcessor@191] - Shutting
down
    [junit] 2017-01-26 12:15:58,101 [myid:] - INFO  [ProcessThread(sid:0 cport:11468)::PrepRequestProcessor@154]
- PrepRequestProcessor exited loop!
    [junit] 2017-01-26 12:15:58,101 [myid:] - INFO  [SyncThread:0:SyncRequestProcessor@169]
- SyncRequestProcessor exited!
    [junit] 2017-01-26 12:15:58,122 [myid:] - INFO  [main:FinalRequestProcessor@479] - shutdown
of request processor complete
    [junit] 2017-01-26 12:15:58,123 [myid:] - INFO  [main:MBeanRegistry@128] - Unregister
MBean [org.apache.ZooKeeperService:name0=StandaloneServer_port11468,name1=InMemoryDataTree]
    [junit] 2017-01-26 12:15:58,123 [myid:] - INFO  [main:MBeanRegistry@128] - Unregister
MBean [org.apache.ZooKeeperService:name0=StandaloneServer_port11468]
    [junit] 2017-01-26 12:15:58,167 [myid:] - INFO  [main:FourLetterWordMain@85] - connecting
to 127.0.0.1 11468
    [junit] 2017-01-26 12:15:58,168 [myid:] - INFO  [main:JMXEnv@146] - ensureOnly:[]
    [junit] 2017-01-26 12:15:58,183 [myid:] - INFO  [main:ClientBase@568] - fdcount after
test is: 7133 at start it was 7129
    [junit] 2017-01-26 12:15:58,183 [myid:] - INFO  [main:ClientBase@570] - sleeping for 20
secs
    [junit] 2017-01-26 12:15:58,183 [myid:] - INFO  [main:ZKTestCase$1@65] - SUCCEEDED testWatcherAutoResetWithLocal
    [junit] 2017-01-26 12:15:58,184 [myid:] - INFO  [main:ZKTestCase$1@60] - FINISHED testWatcherAutoResetWithLocal
    [junit] Tests run: 103, Failures: 0, Errors: 0, Skipped: 0, Time elapsed: 477.205 sec,
Thread: 1, Class: org.apache.zookeeper.test.NioNettySuiteTest

BUILD FAILED
/home/jenkins/jenkins-slave/workspace/ZooKeeper_branch35_jdk8/build.xml:1210: Tests failed!

Total time: 10 minutes 49 seconds
Build step 'Invoke Ant' marked build as failure
Recording test results
Email was triggered for: Failure - Any
Sending email for trigger: Failure - Any



###################################################################################
############################## FAILED TESTS (if any) ##############################
1 tests failed.
FAILED:  org.apache.zookeeper.test.AsyncHammerTest.testHammer

Error Message:
null

Stack Trace:
junit.framework.AssertionFailedError
	at org.apache.zookeeper.test.AsyncHammerTest.testHammer(AsyncHammerTest.java:186)
	at org.apache.zookeeper.JUnit4ZKTestRunner$LoggedInvokeMethod.evaluate(JUnit4ZKTestRunner.java:79)



Mime
  • Unnamed multipart/mixed (inline, None, 0 bytes)
View raw message