zookeeper-dev mailing list archives

Site index · List index
Message view « Date » · « Thread »
Top « Date » · « Thread »
From Apache Jenkins Server <jenk...@builds.apache.org>
Subject ZooKeeper-trunk-solaris - Build # 1484 - Still Failing
Date Sun, 29 Jan 2017 08:33:50 GMT
See https://builds.apache.org/job/ZooKeeper-trunk-solaris/1484/

###################################################################################
########################## LAST 60 LINES OF THE CONSOLE ###########################
[...truncated 471415 lines...]
    [junit] 	at sun.nio.ch.SocketChannelImpl.connect(SocketChannelImpl.java:670)
    [junit] 	at org.apache.zookeeper.ClientCnxnSocketNIO.registerAndConnect(ClientCnxnSocketNIO.java:275)
    [junit] 	at org.apache.zookeeper.ClientCnxnSocketNIO.connect(ClientCnxnSocketNIO.java:285)
    [junit] 	at org.apache.zookeeper.ClientCnxn$SendThread.startConnect(ClientCnxn.java:1098)
    [junit] 	at org.apache.zookeeper.ClientCnxn$SendThread.run(ClientCnxn.java:1133)
    [junit] 2017-01-29 08:33:10,361 [myid:127.0.0.1:11306] - INFO  [main-SendThread(127.0.0.1:11306):ClientCnxn$SendThread@1113]
- Opening socket connection to server 127.0.0.1/127.0.0.1:11306. Will not attempt to authenticate
using SASL (unknown error)
    [junit] 2017-01-29 08:33:10,361 [myid:127.0.0.1:11306] - ERROR [main-SendThread(127.0.0.1:11306):ClientCnxnSocketNIO@287]
- Unable to open socket to 127.0.0.1/127.0.0.1:11306
    [junit] 2017-01-29 08:33:10,361 [myid:127.0.0.1:11306] - WARN  [main-SendThread(127.0.0.1:11306):ClientCnxn$SendThread@1235]
- Session 0x22666521f3e0000 for server null, unexpected error, closing socket connection and
attempting reconnect
    [junit] java.net.ConnectException: Connection refused
    [junit] 	at sun.nio.ch.Net.connect0(Native Method)
    [junit] 	at sun.nio.ch.Net.connect(Net.java:465)
    [junit] 	at sun.nio.ch.Net.connect(Net.java:457)
    [junit] 	at sun.nio.ch.SocketChannelImpl.connect(SocketChannelImpl.java:670)
    [junit] 	at org.apache.zookeeper.ClientCnxnSocketNIO.registerAndConnect(ClientCnxnSocketNIO.java:275)
    [junit] 	at org.apache.zookeeper.ClientCnxnSocketNIO.connect(ClientCnxnSocketNIO.java:285)
    [junit] 	at org.apache.zookeeper.ClientCnxn$SendThread.startConnect(ClientCnxn.java:1098)
    [junit] 	at org.apache.zookeeper.ClientCnxn$SendThread.run(ClientCnxn.java:1133)
    [junit] 2017-01-29 08:33:10,471 [myid:] - INFO  [WorkerSender[myid=3]:FastLeaderElection$Messenger$WorkerSender@470]
- WorkerSender is down
    [junit] 2017-01-29 08:33:10,471 [myid:] - INFO  [WorkerReceiver[myid=3]:FastLeaderElection$Messenger$WorkerReceiver@440]
- WorkerReceiver is down
    [junit] 2017-01-29 08:33:10,531 [myid:127.0.0.1:11266] - INFO  [main-SendThread(127.0.0.1:11266):ClientCnxn$SendThread@1113]
- Opening socket connection to server 127.0.0.1/127.0.0.1:11266. Will not attempt to authenticate
using SASL (unknown error)
    [junit] 2017-01-29 08:33:10,531 [myid:127.0.0.1:11266] - ERROR [main-SendThread(127.0.0.1:11266):ClientCnxnSocketNIO@287]
- Unable to open socket to 127.0.0.1/127.0.0.1:11266
    [junit] 2017-01-29 08:33:10,531 [myid:127.0.0.1:11266] - WARN  [main-SendThread(127.0.0.1:11266):ClientCnxn$SendThread@1235]
- Session 0x0 for server null, unexpected error, closing socket connection and attempting
reconnect
    [junit] java.net.ConnectException: Connection refused
    [junit] 	at sun.nio.ch.Net.connect0(Native Method)
    [junit] 	at sun.nio.ch.Net.connect(Net.java:465)
    [junit] 	at sun.nio.ch.Net.connect(Net.java:457)
    [junit] 	at sun.nio.ch.SocketChannelImpl.connect(SocketChannelImpl.java:670)
    [junit] 	at org.apache.zookeeper.ClientCnxnSocketNIO.registerAndConnect(ClientCnxnSocketNIO.java:275)
    [junit] 	at org.apache.zookeeper.ClientCnxnSocketNIO.connect(ClientCnxnSocketNIO.java:285)
    [junit] 	at org.apache.zookeeper.ClientCnxn$SendThread.startConnect(ClientCnxn.java:1098)
    [junit] 	at org.apache.zookeeper.ClientCnxn$SendThread.run(ClientCnxn.java:1133)
    [junit] 2017-01-29 08:33:10,541 [myid:] - INFO  [WorkerReceiver[myid=2]:FastLeaderElection$Messenger$WorkerReceiver@440]
- WorkerReceiver is down
    [junit] 2017-01-29 08:33:10,541 [myid:] - INFO  [WorkerReceiver[myid=4]:FastLeaderElection$Messenger$WorkerReceiver@440]
- WorkerReceiver is down
    [junit] 2017-01-29 08:33:10,541 [myid:] - INFO  [WorkerReceiver[myid=5]:FastLeaderElection$Messenger$WorkerReceiver@440]
- WorkerReceiver is down
    [junit] 2017-01-29 08:33:10,541 [myid:] - INFO  [WorkerSender[myid=2]:FastLeaderElection$Messenger$WorkerSender@470]
- WorkerSender is down
    [junit] 2017-01-29 08:33:10,551 [myid:] - INFO  [WorkerSender[myid=1]:FastLeaderElection$Messenger$WorkerSender@470]
- WorkerSender is down
    [junit] 2017-01-29 08:33:10,551 [myid:] - INFO  [WorkerReceiver[myid=1]:FastLeaderElection$Messenger$WorkerReceiver@440]
- WorkerReceiver is down
    [junit] Java HotSpot(TM) Server VM warning: INFO: os::commit_memory(0xde400000, 10485760,
0) failed; error='Resource temporarily unavailable' (errno=11)
    [junit] #
    [junit] # There is insufficient memory for the Java Runtime Environment to continue.
    [junit] # Native memory allocation (malloc) failed to allocate 10485760 bytes for committing
reserved memory.
    [junit] # An error report file with more information is saved as:
    [junit] # /zonestorage/hudson_solaris/home/hudson/hudson-slave/workspace/ZooKeeper-trunk-solaris/build/test/hs_err_pid15474.log
    [junit] Running org.apache.zookeeper.test.ReconfigTest
    [junit] Tests run: 1, Failures: 0, Errors: 1, Time elapsed: 0 sec
    [junit] Test org.apache.zookeeper.test.ReconfigTest FAILED (crashed)
    [junit] Running org.apache.zookeeper.test.RecoveryTest
    [junit] Tests run: 1, Failures: 0, Errors: 1, Time elapsed: 0 sec

BUILD FAILED
/zonestorage/hudson_solaris/home/hudson/hudson-slave/workspace/ZooKeeper-trunk-solaris/build.xml:1223:
Process fork failed.

Total time: 75 minutes 54 seconds
Build step 'Invoke Ant' marked build as failure
[locks-and-latches] Releasing all the locks
[locks-and-latches] All the locks released
Recording test results
Email was triggered for: Failure - Any
Sending email for trigger: Failure - Any



###################################################################################
############################## FAILED TESTS (if any) ##############################
3 tests failed.
FAILED:  org.apache.zookeeper.test.WatcherTest.testWatcherAutoResetWithLocal

Error Message:
Unable to connect to server

Stack Trace:
junit.framework.AssertionFailedError: Unable to connect to server
	at org.apache.zookeeper.test.ClientBase.createClient(ClientBase.java:188)
	at org.apache.zookeeper.test.WatcherTest.testWatcherAutoResetWithLocal(WatcherTest.java:239)
	at org.apache.zookeeper.JUnit4ZKTestRunner$LoggedInvokeMethod.evaluate(JUnit4ZKTestRunner.java:79)


FAILED:  org.apache.zookeeper.test.ReconfigTest.testRemoveOneAsynchronous

Error Message:
Forked Java VM exited abnormally. Please note the time in the report does not reflect the
time until the VM exit.

Stack Trace:
junit.framework.AssertionFailedError: Forked Java VM exited abnormally. Please note the time
in the report does not reflect the time until the VM exit.


FAILED:  org.apache.zookeeper.test.RecoveryTest.unknown

Error Message:
Forked Java VM exited abnormally. Please note the time in the report does not reflect the
time until the VM exit.

Stack Trace:
junit.framework.AssertionFailedError: Forked Java VM exited abnormally. Please note the time
in the report does not reflect the time until the VM exit.



Mime
  • Unnamed multipart/mixed (inline, None, 0 bytes)
View raw message