zookeeper-dev mailing list archives

Site index · List index
Message view « Date » · « Thread »
Top « Date » · « Thread »
From Apache Jenkins Server <jenk...@builds.apache.org>
Subject ZooKeeper_branch35_solaris - Build # 401 - Still Failing
Date Thu, 19 Jan 2017 17:08:21 GMT
See https://builds.apache.org/job/ZooKeeper_branch35_solaris/401/

###################################################################################
########################## LAST 60 LINES OF THE CONSOLE ###########################
[...truncated 209408 lines...]
    [junit] 2017-01-19 17:09:08,021 [myid:] - INFO  [ConnnectionExpirer:NIOServerCnxnFactory$ConnectionExpirerThread@583]
- ConnnectionExpirerThread interrupted
    [junit] 2017-01-19 17:09:08,021 [myid:] - INFO  [NIOServerCxnFactory.SelectorThread-1:NIOServerCnxnFactory$SelectorThread@420]
- selector thread exitted run method
    [junit] 2017-01-19 17:09:08,021 [myid:] - INFO  [NIOServerCxnFactory.SelectorThread-0:NIOServerCnxnFactory$SelectorThread@420]
- selector thread exitted run method
    [junit] 2017-01-19 17:09:08,021 [myid:] - INFO  [NIOServerCxnFactory.AcceptThread:/127.0.0.1:11266:NIOServerCnxnFactory$AcceptThread@219]
- accept thread exitted run method
    [junit] 2017-01-19 17:09:08,022 [myid:] - INFO  [main:PortAssignment@85] - Assigned port
11267 from range 11221 - 32767.
    [junit] 2017-01-19 17:09:08,022 [myid:] - INFO  [main:NIOServerCnxnFactory@673] - Configuring
NIO connection handler with 10s sessionless connection timeout, 2 selector thread(s), 16 worker
threads, and 64 kB direct buffers.
    [junit] 2017-01-19 17:09:08,023 [myid:] - INFO  [main:NIOServerCnxnFactory@686] - binding
to port /127.0.0.1:11267
    [junit] 2017-01-19 17:09:08,131 [myid:] - INFO  [NIOServerCxnFactory.AcceptThread:/127.0.0.1:11267:NIOServerCnxnFactory$AcceptThread@219]
- accept thread exitted run method
    [junit] 2017-01-19 17:09:08,131 [myid:] - INFO  [ConnnectionExpirer:NIOServerCnxnFactory$ConnectionExpirerThread@583]
- ConnnectionExpirerThread interrupted
    [junit] 2017-01-19 17:09:08,131 [myid:] - INFO  [NIOServerCxnFactory.SelectorThread-0:NIOServerCnxnFactory$SelectorThread@420]
- selector thread exitted run method
    [junit] 2017-01-19 17:09:08,131 [myid:] - INFO  [NIOServerCxnFactory.SelectorThread-1:NIOServerCnxnFactory$SelectorThread@420]
- selector thread exitted run method
    [junit] 2017-01-19 17:09:08,133 [myid:] - INFO  [main:PortAssignment@85] - Assigned port
11268 from range 11221 - 32767.
    [junit] 2017-01-19 17:09:08,133 [myid:] - INFO  [main:NIOServerCnxnFactory@673] - Configuring
NIO connection handler with 10s sessionless connection timeout, 2 selector thread(s), 16 worker
threads, and 64 kB direct buffers.
    [junit] 2017-01-19 17:09:08,133 [myid:] - INFO  [main:NIOServerCnxnFactory@686] - binding
to port /127.0.0.1:11268
    [junit] 2017-01-19 17:09:08,241 [myid:] - INFO  [ConnnectionExpirer:NIOServerCnxnFactory$ConnectionExpirerThread@583]
- ConnnectionExpirerThread interrupted
    [junit] 2017-01-19 17:09:08,241 [myid:] - INFO  [NIOServerCxnFactory.SelectorThread-1:NIOServerCnxnFactory$SelectorThread@420]
- selector thread exitted run method
    [junit] 2017-01-19 17:09:08,241 [myid:] - INFO  [NIOServerCxnFactory.AcceptThread:/127.0.0.1:11268:NIOServerCnxnFactory$AcceptThread@219]
- accept thread exitted run method
    [junit] 2017-01-19 17:09:08,241 [myid:] - INFO  [NIOServerCxnFactory.SelectorThread-0:NIOServerCnxnFactory$SelectorThread@420]
- selector thread exitted run method
    [junit] 2017-01-19 17:09:08,242 [myid:] - INFO  [main:PortAssignment@85] - Assigned port
11269 from range 11221 - 32767.
    [junit] 2017-01-19 17:09:08,242 [myid:] - INFO  [main:NIOServerCnxnFactory@673] - Configuring
NIO connection handler with 10s sessionless connection timeout, 2 selector thread(s), 16 worker
threads, and 64 kB direct buffers.
    [junit] 2017-01-19 17:09:08,242 [myid:] - INFO  [main:NIOServerCnxnFactory@686] - binding
to port /127.0.0.1:11269
    [junit] 2017-01-19 17:09:08,351 [myid:] - INFO  [NIOServerCxnFactory.SelectorThread-1:NIOServerCnxnFactory$SelectorThread@420]
- selector thread exitted run method
    [junit] 2017-01-19 17:09:08,351 [myid:] - INFO  [ConnnectionExpirer:NIOServerCnxnFactory$ConnectionExpirerThread@583]
- ConnnectionExpirerThread interrupted
    [junit] 2017-01-19 17:09:08,351 [myid:] - INFO  [NIOServerCxnFactory.AcceptThread:/127.0.0.1:11269:NIOServerCnxnFactory$AcceptThread@219]
- accept thread exitted run method
    [junit] 2017-01-19 17:09:08,351 [myid:] - INFO  [NIOServerCxnFactory.SelectorThread-0:NIOServerCnxnFactory$SelectorThread@420]
- selector thread exitted run method
    [junit] 2017-01-19 17:09:08,452 [myid:] - INFO  [main:PortAssignment@85] - Assigned port
11270 from range 11221 - 32767.
    [junit] 2017-01-19 17:09:08,452 [myid:] - INFO  [main:NIOServerCnxnFactory@673] - Configuring
NIO connection handler with 10s sessionless connection timeout, 2 selector thread(s), 16 worker
threads, and 64 kB direct buffers.
    [junit] 2017-01-19 17:09:08,453 [myid:] - INFO  [main:NIOServerCnxnFactory@686] - binding
to port /127.0.0.1:11270
    [junit] 2017-01-19 17:09:08,561 [myid:] - INFO  [ConnnectionExpirer:NIOServerCnxnFactory$ConnectionExpirerThread@583]
- ConnnectionExpirerThread interrupted
    [junit] 2017-01-19 17:09:08,561 [myid:] - INFO  [NIOServerCxnFactory.SelectorThread-0:NIOServerCnxnFactory$SelectorThread@420]
- selector thread exitted run method
    [junit] 2017-01-19 17:09:08,561 [myid:] - INFO  [NIOServerCxnFactory.AcceptThread:/127.0.0.1:11270:NIOServerCnxnFactory$AcceptThread@219]
- accept thread exitted run method
    [junit] 2017-01-19 17:09:08,561 [myid:] - INFO  [NIOServerCxnFactory.SelectorThread-1:NIOServerCnxnFactory$SelectorThread@420]
- selector thread exitted run method
    [junit] 2017-01-19 17:09:08,562 [myid:] - INFO  [main:PortAssignment@85] - Assigned port
11271 from range 11221 - 32767.
    [junit] 2017-01-19 17:09:08,562 [myid:] - INFO  [main:NIOServerCnxnFactory@673] - Configuring
NIO connection handler with 10s sessionless connection timeout, 2 selector thread(s), 16 worker
threads, and 64 kB direct buffers.
    [junit] 2017-01-19 17:09:08,563 [myid:] - INFO  [main:NIOServerCnxnFactory@686] - binding
to port /127.0.0.1:11271
    [junit] 2017-01-19 17:09:08,671 [myid:] - INFO  [NIOServerCxnFactory.AcceptThread:/127.0.0.1:11271:NIOServerCnxnFactory$AcceptThread@219]
- accept thread exitted run method
    [junit] 2017-01-19 17:09:08,671 [myid:] - INFO  [ConnnectionExpirer:NIOServerCnxnFactory$ConnectionExpirerThread@583]
- ConnnectionExpirerThread interrupted
    [junit] 2017-01-19 17:09:08,672 [myid:] - INFO  [NIOServerCxnFactory.SelectorThread-1:NIOServerCnxnFactory$SelectorThread@420]
- selector thread exitted run method
    [junit] 2017-01-19 17:09:08,672 [myid:] - INFO  [NIOServerCxnFactory.SelectorThread-0:NIOServerCnxnFactory$SelectorThread@420]
- selector thread exitted run method
    [junit] 2017-01-19 17:09:08,673 [myid:] - INFO  [main:NIOConnectionFactoryFdLeakTest@63]
- End fdcount is: 44
    [junit] 2017-01-19 17:09:08,674 [myid:] - INFO  [main:JUnit4ZKTestRunner$LoggedInvokeMethod@82]
- Memory used 9336
    [junit] 2017-01-19 17:09:08,674 [myid:] - INFO  [main:JUnit4ZKTestRunner$LoggedInvokeMethod@87]
- Number of threads 4
    [junit] 2017-01-19 17:09:08,674 [myid:] - INFO  [main:JUnit4ZKTestRunner$LoggedInvokeMethod@102]
- FINISHED TEST METHOD testFileDescriptorLeak
    [junit] 2017-01-19 17:09:08,674 [myid:] - INFO  [main:ZKTestCase$1@65] - SUCCEEDED testFileDescriptorLeak
    [junit] 2017-01-19 17:09:08,674 [myid:] - INFO  [main:ZKTestCase$1@60] - FINISHED testFileDescriptorLeak
    [junit] Tests run: 1, Failures: 0, Errors: 0, Time elapsed: 11.26 sec
    [junit] Running org.apache.zookeeper.test.NettyNettySuiteHammerTest
    [junit] Tests run: 1, Failures: 0, Errors: 1, Time elapsed: 0 sec

BUILD FAILED
/zonestorage/hudson_solaris/home/hudson/hudson-slave/workspace/ZooKeeper_branch35_solaris/build.xml:1222:
Process fork failed.

Total time: 59 minutes 5 seconds
Build step 'Invoke Ant' marked build as failure
[locks-and-latches] Releasing all the locks
[locks-and-latches] All the locks released
Recording test results
Email was triggered for: Failure - Any
Sending email for trigger: Failure - Any



###################################################################################
############################## FAILED TESTS (if any) ##############################
3 tests failed.
FAILED:  org.apache.zookeeper.server.admin.JettyAdminServerTest.testQuorum

Error Message:
Connection refused

Stack Trace:
java.net.ConnectException: Connection refused
	at java.net.PlainSocketImpl.socketConnect(Native Method)
	at java.net.AbstractPlainSocketImpl.doConnect(AbstractPlainSocketImpl.java:339)
	at java.net.AbstractPlainSocketImpl.connectToAddress(AbstractPlainSocketImpl.java:200)
	at java.net.AbstractPlainSocketImpl.connect(AbstractPlainSocketImpl.java:182)
	at java.net.SocksSocketImpl.connect(SocksSocketImpl.java:392)
	at java.net.Socket.connect(Socket.java:579)
	at java.net.Socket.connect(Socket.java:528)
	at sun.net.NetworkClient.doConnect(NetworkClient.java:180)
	at sun.net.www.http.HttpClient.openServer(HttpClient.java:432)
	at sun.net.www.http.HttpClient.openServer(HttpClient.java:527)
	at sun.net.www.http.HttpClient.<init>(HttpClient.java:211)
	at sun.net.www.http.HttpClient.New(HttpClient.java:308)
	at sun.net.www.http.HttpClient.New(HttpClient.java:326)
	at sun.net.www.protocol.http.HttpURLConnection.getNewHttpClient(HttpURLConnection.java:997)
	at sun.net.www.protocol.http.HttpURLConnection.plainConnect(HttpURLConnection.java:933)
	at sun.net.www.protocol.http.HttpURLConnection.connect(HttpURLConnection.java:851)
	at sun.net.www.protocol.http.HttpURLConnection.getInputStream(HttpURLConnection.java:1301)
	at java.net.URL.openStream(URL.java:1037)
	at org.apache.zookeeper.server.admin.JettyAdminServerTest.queryAdminServer(JettyAdminServerTest.java:158)
	at org.apache.zookeeper.server.admin.JettyAdminServerTest.queryAdminServer(JettyAdminServerTest.java:150)
	at org.apache.zookeeper.server.admin.JettyAdminServerTest.testQuorum(JettyAdminServerTest.java:131)
	at org.apache.zookeeper.JUnit4ZKTestRunner$LoggedInvokeMethod.evaluate(JUnit4ZKTestRunner.java:79)


FAILED:  org.apache.zookeeper.server.quorum.CommitProcessorTest.testOneCommitWorker

Error Message:
No read requests processed

Stack Trace:
junit.framework.AssertionFailedError: No read requests processed
	at org.apache.zookeeper.server.quorum.CommitProcessorTest.checkProcessedRequest(CommitProcessorTest.java:202)
	at org.apache.zookeeper.server.quorum.CommitProcessorTest.testOneCommitWorker(CommitProcessorTest.java:186)
	at org.apache.zookeeper.JUnit4ZKTestRunner$LoggedInvokeMethod.evaluate(JUnit4ZKTestRunner.java:79)


FAILED:  org.apache.zookeeper.test.NettyNettySuiteHammerTest.unknown

Error Message:
Forked Java VM exited abnormally. Please note the time in the report does not reflect the
time until the VM exit.

Stack Trace:
junit.framework.AssertionFailedError: Forked Java VM exited abnormally. Please note the time
in the report does not reflect the time until the VM exit.



Mime
  • Unnamed multipart/mixed (inline, None, 0 bytes)
View raw message