zookeeper-dev mailing list archives

Site index · List index
Message view « Date » · « Thread »
Top « Date » · « Thread »
From Apache Jenkins Server <jenk...@builds.apache.org>
Subject ZooKeeper-trunk - Build # 3249 - Failure
Date Wed, 25 Jan 2017 00:22:55 GMT
See https://builds.apache.org/job/ZooKeeper-trunk/3249/

###################################################################################
########################## LAST 60 LINES OF THE CONSOLE ###########################
[...truncated 488559 lines...]
    [junit] 	at org.jboss.netty.channel.socket.nio.AbstractNioSelector.processTaskQueue(AbstractNioSelector.java:391)
    [junit] 	at org.jboss.netty.channel.socket.nio.AbstractNioSelector.run(AbstractNioSelector.java:315)
    [junit] 	at org.jboss.netty.channel.socket.nio.AbstractNioWorker.run(AbstractNioWorker.java:89)
    [junit] 	at org.jboss.netty.channel.socket.nio.NioWorker.run(NioWorker.java:178)
    [junit] 	at org.jboss.netty.util.ThreadRenamingRunnable.run(ThreadRenamingRunnable.java:108)
    [junit] 	at org.jboss.netty.util.internal.DeadLockProofWorker$1.run(DeadLockProofWorker.java:42)
    [junit] 	at java.util.concurrent.ThreadPoolExecutor.runWorker(ThreadPoolExecutor.java:1145)
    [junit] 	at java.util.concurrent.ThreadPoolExecutor$Worker.run(ThreadPoolExecutor.java:615)
    [junit] 	at java.lang.Thread.run(Thread.java:745)
    [junit] 2017-01-25 00:22:26,085 [myid:] - INFO  [New I/O worker #16174:ClientCnxnSocketNetty$ZKClientHandler@384]
- channel is disconnected: [id: 0x5ec50699, /127.0.0.1:48435 :> 127.0.0.1/127.0.0.1:19547]
    [junit] 2017-01-25 00:22:26,120 [myid:] - INFO  [New I/O worker #16174:ClientCnxnSocketNetty@208]
- channel is told closing
    [junit] 2017-01-25 00:22:26,085 [myid:] - INFO  [SyncThread:0:MBeanRegistry@128] - Unregister
MBean [org.apache.ZooKeeperService:name0=StandaloneServer_port19547,name1=Connections,name2=127.0.0.1,name3=0x10095a9aa160000]
    [junit] 2017-01-25 00:22:26,120 [myid:] - INFO  [main:ClientCnxnSocketNetty@208] - channel
is told closing
    [junit] 2017-01-25 00:22:26,120 [myid:] - INFO  [main:ZooKeeper@1324] - Session: 0x10095a9aa160000
closed
    [junit] 2017-01-25 00:22:26,120 [myid:] - INFO  [main-EventThread:ClientCnxn$EventThread@513]
- EventThread shut down for session: 0x10095a9aa160000
    [junit] 2017-01-25 00:22:26,121 [myid:] - INFO  [main:JUnit4ZKTestRunner$LoggedInvokeMethod@82]
- Memory used 222549
    [junit] 2017-01-25 00:22:26,121 [myid:] - INFO  [main:JUnit4ZKTestRunner$LoggedInvokeMethod@87]
- Number of threads 1812
    [junit] 2017-01-25 00:22:26,121 [myid:] - INFO  [main:JUnit4ZKTestRunner$LoggedInvokeMethod@102]
- FINISHED TEST METHOD testWatcherAutoResetWithLocal
    [junit] 2017-01-25 00:22:26,121 [myid:] - INFO  [main:ClientBase@558] - tearDown starting
    [junit] 2017-01-25 00:22:26,121 [myid:] - INFO  [main:ClientBase@528] - STOPPING server
    [junit] 2017-01-25 00:22:26,121 [myid:] - INFO  [main:NettyServerCnxnFactory@464] - shutdown
called 0.0.0.0/0.0.0.0:19547
    [junit] 2017-01-25 00:22:26,126 [myid:] - INFO  [main:ZooKeeperServer@534] - shutting
down
    [junit] 2017-01-25 00:22:26,126 [myid:] - ERROR [main:ZooKeeperServer@506] - ZKShutdownHandler
is not registered, so ZooKeeper server won't take any action on ERROR or SHUTDOWN server state
changes
    [junit] 2017-01-25 00:22:26,126 [myid:] - INFO  [main:SessionTrackerImpl@232] - Shutting
down
    [junit] 2017-01-25 00:22:26,126 [myid:] - INFO  [main:PrepRequestProcessor@1009] - Shutting
down
    [junit] 2017-01-25 00:22:26,127 [myid:] - INFO  [main:SyncRequestProcessor@191] - Shutting
down
    [junit] 2017-01-25 00:22:26,127 [myid:] - INFO  [SyncThread:0:SyncRequestProcessor@169]
- SyncRequestProcessor exited!
    [junit] 2017-01-25 00:22:26,127 [myid:] - INFO  [main:FinalRequestProcessor@481] - shutdown
of request processor complete
    [junit] 2017-01-25 00:22:26,127 [myid:] - INFO  [ProcessThread(sid:0 cport:19547)::PrepRequestProcessor@157]
- PrepRequestProcessor exited loop!
    [junit] 2017-01-25 00:22:26,127 [myid:] - INFO  [main:MBeanRegistry@128] - Unregister
MBean [org.apache.ZooKeeperService:name0=StandaloneServer_port19547,name1=InMemoryDataTree]
    [junit] 2017-01-25 00:22:26,127 [myid:] - INFO  [main:MBeanRegistry@128] - Unregister
MBean [org.apache.ZooKeeperService:name0=StandaloneServer_port19547]
    [junit] 2017-01-25 00:22:26,128 [myid:] - INFO  [main:FourLetterWordMain@85] - connecting
to 127.0.0.1 19547
    [junit] 2017-01-25 00:22:26,128 [myid:] - INFO  [main:JMXEnv@146] - ensureOnly:[]
    [junit] 2017-01-25 00:22:26,134 [myid:] - INFO  [main:ClientBase@583] - fdcount after
test is: 5211 at start it was 5211
    [junit] 2017-01-25 00:22:26,134 [myid:] - INFO  [main:ZKTestCase$1@65] - SUCCEEDED testWatcherAutoResetWithLocal
    [junit] 2017-01-25 00:22:26,134 [myid:] - INFO  [main:ZKTestCase$1@60] - FINISHED testWatcherAutoResetWithLocal
    [junit] Tests run: 103, Failures: 0, Errors: 0, Skipped: 0, Time elapsed: 567.356 sec,
Thread: 4, Class: org.apache.zookeeper.test.NettyNettySuiteTest

BUILD FAILED
/home/jenkins/jenkins-slave/workspace/ZooKeeper-trunk/build.xml:1326: The following error
occurred while executing this line:
/home/jenkins/jenkins-slave/workspace/ZooKeeper-trunk/build.xml:1211: Tests failed!

Total time: 13 minutes 46 seconds
Build step 'Execute shell' marked build as failure
[FINDBUGS] Skipping publisher since build result is FAILURE
[WARNINGS] Skipping publisher since build result is FAILURE
Archiving artifacts
Setting JDK_1_7_LATEST__HOME=/home/jenkins/tools/java/latest1.7
Recording fingerprints
Setting JDK_1_7_LATEST__HOME=/home/jenkins/tools/java/latest1.7
Recording test results
Setting JDK_1_7_LATEST__HOME=/home/jenkins/tools/java/latest1.7
Publishing Javadoc
Setting JDK_1_7_LATEST__HOME=/home/jenkins/tools/java/latest1.7
Setting JDK_1_7_LATEST__HOME=/home/jenkins/tools/java/latest1.7
Email was triggered for: Failure - Any
Sending email for trigger: Failure - Any
Setting JDK_1_7_LATEST__HOME=/home/jenkins/tools/java/latest1.7
Setting JDK_1_7_LATEST__HOME=/home/jenkins/tools/java/latest1.7



###################################################################################
############################## FAILED TESTS (if any) ##############################
1 tests failed.
FAILED:  org.apache.zookeeper.server.quorum.ReconfigDuringLeaderSyncTest.testDuringLeaderSync

Error Message:
zoo.cfg.dynamic.next is not deleted.

Stack Trace:
junit.framework.AssertionFailedError: zoo.cfg.dynamic.next is not deleted.
	at org.apache.zookeeper.server.quorum.ReconfigDuringLeaderSyncTest.testDuringLeaderSync(ReconfigDuringLeaderSyncTest.java:165)
	at org.apache.zookeeper.JUnit4ZKTestRunner$LoggedInvokeMethod.evaluate(JUnit4ZKTestRunner.java:79)



Mime
  • Unnamed multipart/mixed (inline, None, 0 bytes)
View raw message