zookeeper-dev mailing list archives

Site index · List index
Message view « Date » · « Thread »
Top « Date » · « Thread »
From Apache Jenkins Server <jenk...@builds.apache.org>
Subject ZooKeeper_branch34_solaris - Build # 1421 - Still Failing
Date Fri, 06 Jan 2017 12:51:16 GMT
See https://builds.apache.org/job/ZooKeeper_branch34_solaris/1421/

###################################################################################
########################## LAST 60 LINES OF THE CONSOLE ###########################
[...truncated 189446 lines...]
    [junit] 2017-01-06 12:52:45,696 [myid:] - INFO  [main:ZooKeeperServer@497] - shutting
down
    [junit] 2017-01-06 12:52:45,696 [myid:] - ERROR [main:ZooKeeperServer@472] - ZKShutdownHandler
is not registered, so ZooKeeper server won't take any action on ERROR or SHUTDOWN server state
changes
    [junit] 2017-01-06 12:52:45,696 [myid:] - INFO  [main:SessionTrackerImpl@225] - Shutting
down
    [junit] 2017-01-06 12:52:45,697 [myid:] - INFO  [main:PrepRequestProcessor@765] - Shutting
down
    [junit] 2017-01-06 12:52:45,697 [myid:] - INFO  [main:SyncRequestProcessor@208] - Shutting
down
    [junit] 2017-01-06 12:52:45,697 [myid:] - INFO  [ProcessThread(sid:0 cport:11221)::PrepRequestProcessor@143]
- PrepRequestProcessor exited loop!
    [junit] 2017-01-06 12:52:45,697 [myid:] - INFO  [SyncThread:0:SyncRequestProcessor@186]
- SyncRequestProcessor exited!
    [junit] 2017-01-06 12:52:45,697 [myid:] - INFO  [main:FinalRequestProcessor@402] - shutdown
of request processor complete
    [junit] 2017-01-06 12:52:45,698 [myid:] - INFO  [main:FourLetterWordMain@62] - connecting
to 127.0.0.1 11221
    [junit] 2017-01-06 12:52:45,698 [myid:] - INFO  [main:JMXEnv@147] - ensureOnly:[]
    [junit] 2017-01-06 12:52:45,699 [myid:] - INFO  [main:ClientBase@445] - STARTING server
    [junit] 2017-01-06 12:52:45,699 [myid:] - INFO  [main:ClientBase@366] - CREATING server
instance 127.0.0.1:11221
    [junit] 2017-01-06 12:52:45,700 [myid:] - INFO  [main:NIOServerCnxnFactory@89] - binding
to port 0.0.0.0/0.0.0.0:11221
    [junit] 2017-01-06 12:52:45,700 [myid:] - INFO  [main:ClientBase@341] - STARTING server
instance 127.0.0.1:11221
    [junit] 2017-01-06 12:52:45,700 [myid:] - INFO  [main:ZooKeeperServer@173] - Created server
with tickTime 3000 minSessionTimeout 6000 maxSessionTimeout 60000 datadir /zonestorage/hudson_solaris/home/hudson/hudson-slave/workspace/ZooKeeper_branch34_solaris/build/test/tmp/test7817216924733559167.junit.dir/version-2
snapdir /zonestorage/hudson_solaris/home/hudson/hudson-slave/workspace/ZooKeeper_branch34_solaris/build/test/tmp/test7817216924733559167.junit.dir/version-2
    [junit] 2017-01-06 12:52:45,703 [myid:] - ERROR [main:ZooKeeperServer@472] - ZKShutdownHandler
is not registered, so ZooKeeper server won't take any action on ERROR or SHUTDOWN server state
changes
    [junit] 2017-01-06 12:52:45,703 [myid:] - INFO  [main:FourLetterWordMain@62] - connecting
to 127.0.0.1 11221
    [junit] 2017-01-06 12:52:45,703 [myid:] - INFO  [NIOServerCxn.Factory:0.0.0.0/0.0.0.0:11221:NIOServerCnxnFactory@192]
- Accepted socket connection from /127.0.0.1:40357
    [junit] 2017-01-06 12:52:45,704 [myid:] - INFO  [NIOServerCxn.Factory:0.0.0.0/0.0.0.0:11221:NIOServerCnxn@827]
- Processing stat command from /127.0.0.1:40357
    [junit] 2017-01-06 12:52:45,704 [myid:] - INFO  [Thread-5:NIOServerCnxn$StatCommand@663]
- Stat command output
    [junit] 2017-01-06 12:52:45,705 [myid:] - INFO  [Thread-5:NIOServerCnxn@1008] - Closed
socket connection for client /127.0.0.1:40357 (no session established for client)
    [junit] 2017-01-06 12:52:45,711 [myid:] - INFO  [main:JMXEnv@230] - ensureParent:[InMemoryDataTree,
StandaloneServer_port]
    [junit] 2017-01-06 12:52:45,712 [myid:] - INFO  [main:JMXEnv@247] - expect:InMemoryDataTree
    [junit] 2017-01-06 12:52:45,712 [myid:] - INFO  [main:JMXEnv@251] - found:InMemoryDataTree
org.apache.ZooKeeperService:name0=StandaloneServer_port11221,name1=InMemoryDataTree
    [junit] 2017-01-06 12:52:45,712 [myid:] - INFO  [main:JMXEnv@247] - expect:StandaloneServer_port
    [junit] 2017-01-06 12:52:45,712 [myid:] - INFO  [main:JMXEnv@251] - found:StandaloneServer_port
org.apache.ZooKeeperService:name0=StandaloneServer_port11221
    [junit] 2017-01-06 12:52:45,713 [myid:] - INFO  [main:JUnit4ZKTestRunner$LoggedInvokeMethod@58]
- Memory used 8950
    [junit] 2017-01-06 12:52:45,713 [myid:] - INFO  [main:JUnit4ZKTestRunner$LoggedInvokeMethod@63]
- Number of threads 20
    [junit] 2017-01-06 12:52:45,713 [myid:] - INFO  [main:JUnit4ZKTestRunner$LoggedInvokeMethod@78]
- FINISHED TEST METHOD testQuota
    [junit] 2017-01-06 12:52:45,713 [myid:] - INFO  [main:ClientBase@522] - tearDown starting
    [junit] 2017-01-06 12:52:45,782 [myid:] - INFO  [main:ZooKeeper@684] - Session: 0x15973d6a9220000
closed
    [junit] 2017-01-06 12:52:45,782 [myid:] - INFO  [main-EventThread:ClientCnxn$EventThread@519]
- EventThread shut down for session: 0x15973d6a9220000
    [junit] 2017-01-06 12:52:45,782 [myid:] - INFO  [main:ClientBase@492] - STOPPING server
    [junit] 2017-01-06 12:52:45,783 [myid:] - INFO  [main:ZooKeeperServer@497] - shutting
down
    [junit] 2017-01-06 12:52:45,783 [myid:] - ERROR [main:ZooKeeperServer@472] - ZKShutdownHandler
is not registered, so ZooKeeper server won't take any action on ERROR or SHUTDOWN server state
changes
    [junit] 2017-01-06 12:52:45,783 [myid:] - INFO  [main:SessionTrackerImpl@225] - Shutting
down
    [junit] 2017-01-06 12:52:45,783 [myid:] - INFO  [main:PrepRequestProcessor@765] - Shutting
down
    [junit] 2017-01-06 12:52:45,783 [myid:] - INFO  [main:SyncRequestProcessor@208] - Shutting
down
    [junit] 2017-01-06 12:52:45,783 [myid:] - INFO  [ProcessThread(sid:0 cport:11221)::PrepRequestProcessor@143]
- PrepRequestProcessor exited loop!
    [junit] 2017-01-06 12:52:45,783 [myid:] - INFO  [SyncThread:0:SyncRequestProcessor@186]
- SyncRequestProcessor exited!
    [junit] 2017-01-06 12:52:45,784 [myid:] - INFO  [main:FinalRequestProcessor@402] - shutdown
of request processor complete
    [junit] 2017-01-06 12:52:45,784 [myid:] - INFO  [main:FourLetterWordMain@62] - connecting
to 127.0.0.1 11221
    [junit] 2017-01-06 12:52:45,785 [myid:] - INFO  [main:JMXEnv@147] - ensureOnly:[]
    [junit] 2017-01-06 12:52:45,788 [myid:] - INFO  [main:ClientBase@547] - fdcount after
test is: 59 at start it was 45
    [junit] 2017-01-06 12:52:45,788 [myid:] - INFO  [main:ClientBase@549] - sleeping for 20
secs
    [junit] 2017-01-06 12:52:45,789 [myid:] - INFO  [main:ZKTestCase$1@65] - SUCCEEDED testQuota
    [junit] 2017-01-06 12:52:45,789 [myid:] - INFO  [main:ZKTestCase$1@60] - FINISHED testQuota
    [junit] Tests run: 1, Failures: 0, Errors: 0, Time elapsed: 1.752 sec

BUILD FAILED
/zonestorage/hudson_solaris/home/hudson/hudson-slave/workspace/ZooKeeper_branch34_solaris/build.xml:1325:
Tests failed!

Total time: 27 minutes 54 seconds
Build step 'Invoke Ant' marked build as failure
[locks-and-latches] Releasing all the locks
[locks-and-latches] All the locks released
Recording test results
Email was triggered for: Failure - Any
Sending email for trigger: Failure - Any



###################################################################################
############################## FAILED TESTS (if any) ##############################
5 tests failed.
FAILED:  org.apache.zookeeper.server.quorum.QuorumPeerMainTest.testEarlyLeaderAbandonment

Error Message:
Waiting too long

Stack Trace:
java.lang.RuntimeException: Waiting too long
	at org.apache.zookeeper.server.quorum.QuorumPeerMainTest.waitForAll(QuorumPeerMainTest.java:348)
	at org.apache.zookeeper.server.quorum.QuorumPeerMainTest.testEarlyLeaderAbandonment(QuorumPeerMainTest.java:163)
	at org.apache.zookeeper.JUnit4ZKTestRunner$LoggedInvokeMethod.evaluate(JUnit4ZKTestRunner.java:55)


FAILED:  org.apache.zookeeper.server.quorum.QuorumPeerMainTest.testHighestZxidJoinLate

Error Message:
Waiting too long

Stack Trace:
java.lang.RuntimeException: Waiting too long
	at org.apache.zookeeper.server.quorum.QuorumPeerMainTest.waitForAll(QuorumPeerMainTest.java:348)
	at org.apache.zookeeper.server.quorum.QuorumPeerMainTest.LaunchServers(QuorumPeerMainTest.java:394)
	at org.apache.zookeeper.server.quorum.QuorumPeerMainTest.testHighestZxidJoinLate(QuorumPeerMainTest.java:246)
	at org.apache.zookeeper.JUnit4ZKTestRunner$LoggedInvokeMethod.evaluate(JUnit4ZKTestRunner.java:55)


FAILED:  junit.framework.TestSuite.org.apache.zookeeper.server.quorum.auth.MiniKdcTest

Error Message:
org/apache/kerby/kerberos/kerb/KrbException : Unsupported major.minor version 51.0

Stack Trace:
java.lang.UnsupportedClassVersionError: org/apache/kerby/kerberos/kerb/KrbException : Unsupported
major.minor version 51.0
	at java.lang.ClassLoader.defineClass1(Native Method)
	at java.lang.ClassLoader.defineClassCond(ClassLoader.java:631)
	at java.lang.ClassLoader.defineClass(ClassLoader.java:615)
	at java.security.SecureClassLoader.defineClass(SecureClassLoader.java:141)
	at java.net.URLClassLoader.defineClass(URLClassLoader.java:283)
	at java.net.URLClassLoader.access$000(URLClassLoader.java:58)
	at java.net.URLClassLoader$1.run(URLClassLoader.java:197)
	at java.security.AccessController.doPrivileged(Native Method)
	at java.net.URLClassLoader.findClass(URLClassLoader.java:190)
	at java.lang.ClassLoader.loadClass(ClassLoader.java:306)
	at sun.misc.Launcher$AppClassLoader.loadClass(Launcher.java:301)
	at java.lang.ClassLoader.loadClass(ClassLoader.java:247)
	at org.apache.zookeeper.server.quorum.auth.KerberosSecurityTestcase.createMiniKdcConf(KerberosSecurityTestcase.java:100)
	at org.apache.zookeeper.server.quorum.auth.KerberosSecurityTestcase.startMiniKdc(KerberosSecurityTestcase.java:67)
	at org.apache.zookeeper.server.quorum.auth.KerberosSecurityTestcase.setUpSasl(KerberosSecurityTestcase.java:56)


FAILED:  junit.framework.TestSuite.org.apache.zookeeper.server.quorum.auth.QuorumKerberosAuthTest

Error Message:
org/apache/kerby/kerberos/kerb/KrbException : Unsupported major.minor version 51.0

Stack Trace:
java.lang.UnsupportedClassVersionError: org/apache/kerby/kerberos/kerb/KrbException : Unsupported
major.minor version 51.0
	at java.lang.ClassLoader.defineClass1(Native Method)
	at java.lang.ClassLoader.defineClassCond(ClassLoader.java:631)
	at java.lang.ClassLoader.defineClass(ClassLoader.java:615)
	at java.security.SecureClassLoader.defineClass(SecureClassLoader.java:141)
	at java.net.URLClassLoader.defineClass(URLClassLoader.java:283)
	at java.net.URLClassLoader.access$000(URLClassLoader.java:58)
	at java.net.URLClassLoader$1.run(URLClassLoader.java:197)
	at java.security.AccessController.doPrivileged(Native Method)
	at java.net.URLClassLoader.findClass(URLClassLoader.java:190)
	at java.lang.ClassLoader.loadClass(ClassLoader.java:306)
	at sun.misc.Launcher$AppClassLoader.loadClass(Launcher.java:301)
	at java.lang.ClassLoader.loadClass(ClassLoader.java:247)
	at org.apache.zookeeper.server.quorum.auth.KerberosSecurityTestcase.createMiniKdcConf(KerberosSecurityTestcase.java:100)
	at org.apache.zookeeper.server.quorum.auth.KerberosSecurityTestcase.startMiniKdc(KerberosSecurityTestcase.java:67)
	at org.apache.zookeeper.server.quorum.auth.KerberosSecurityTestcase.setUpSasl(KerberosSecurityTestcase.java:56)


FAILED:  junit.framework.TestSuite.org.apache.zookeeper.server.quorum.auth.QuorumKerberosHostBasedAuthTest

Error Message:
org/apache/kerby/kerberos/kerb/KrbException : Unsupported major.minor version 51.0

Stack Trace:
java.lang.UnsupportedClassVersionError: org/apache/kerby/kerberos/kerb/KrbException : Unsupported
major.minor version 51.0
	at java.lang.ClassLoader.defineClass1(Native Method)
	at java.lang.ClassLoader.defineClassCond(ClassLoader.java:631)
	at java.lang.ClassLoader.defineClass(ClassLoader.java:615)
	at java.security.SecureClassLoader.defineClass(SecureClassLoader.java:141)
	at java.net.URLClassLoader.defineClass(URLClassLoader.java:283)
	at java.net.URLClassLoader.access$000(URLClassLoader.java:58)
	at java.net.URLClassLoader$1.run(URLClassLoader.java:197)
	at java.security.AccessController.doPrivileged(Native Method)
	at java.net.URLClassLoader.findClass(URLClassLoader.java:190)
	at java.lang.ClassLoader.loadClass(ClassLoader.java:306)
	at sun.misc.Launcher$AppClassLoader.loadClass(Launcher.java:301)
	at java.lang.ClassLoader.loadClass(ClassLoader.java:247)
	at org.apache.zookeeper.server.quorum.auth.KerberosSecurityTestcase.createMiniKdcConf(KerberosSecurityTestcase.java:100)
	at org.apache.zookeeper.server.quorum.auth.KerberosSecurityTestcase.startMiniKdc(KerberosSecurityTestcase.java:67)
	at org.apache.zookeeper.server.quorum.auth.KerberosSecurityTestcase.setUpSasl(KerberosSecurityTestcase.java:56)



Mime
  • Unnamed multipart/mixed (inline, None, 0 bytes)
View raw message