zookeeper-dev mailing list archives

Site index · List index
Message view « Date » · « Thread »
Top « Date » · « Thread »
From Apache Jenkins Server <jenk...@builds.apache.org>
Subject ZooKeeper-trunk - Build # 3237 - Still Failing
Date Sat, 14 Jan 2017 06:40:11 GMT
See https://builds.apache.org/job/ZooKeeper-trunk/3237/

###################################################################################
########################## LAST 60 LINES OF THE CONSOLE ###########################
[...truncated 494979 lines...]
     [exec] Log Message Received: [2017-01-14 06:36:19,022:1451(0x2abbd49c1540):ZOO_INFO@zookeeper_init_internal@1128:
Initiating client connection, host=127.0.0.1:22181 sessionTimeout=10000 watcher=0x461d20 sessionId=0
sessionPasswd=<null> context=0x7ffd12027230 flags=0]
     [exec] Log Message Received: [2017-01-14 06:36:19,023:1451(0x2abbd6a1e700):ZOO_INFO@check_events@2390:
initiated connection to server [127.0.0.1:22181]]
     [exec] Log Message Received: [2017-01-14 06:36:19,106:1451(0x2abbd6a1e700):ZOO_INFO@check_events@2442:
session establishment complete on server [127.0.0.1:22181], sessionId=0x1022c216d86000f, negotiated
timeout=10000 ]
     [exec]  : elapsed 1000 : OK
     [exec] Zookeeper_simpleSystem::testAsyncWatcherAutoReset ZooKeeper server started : elapsed
10774 : OK
     [exec] Zookeeper_simpleSystem::testDeserializeString : elapsed 0 : OK
     [exec] Zookeeper_simpleSystem::testFirstServerDown : elapsed 1000 : OK
     [exec] Zookeeper_simpleSystem::testNullData : elapsed 1049 : OK
     [exec] Zookeeper_simpleSystem::testIPV6 : elapsed 1012 : OK
     [exec] Zookeeper_simpleSystem::testCreate : elapsed 1037 : OK
     [exec] Zookeeper_simpleSystem::testPath : elapsed 1082 : OK
     [exec] Zookeeper_simpleSystem::testPathValidation : elapsed 1141 : OK
     [exec] Zookeeper_simpleSystem::testPing : elapsed 17999 : OK
     [exec] Zookeeper_simpleSystem::testAcl : elapsed 1026 : OK
     [exec] Zookeeper_simpleSystem::testChroot : elapsed 4123 : OK
     [exec] Zookeeper_simpleSystem::testAuth ZooKeeper server started ZooKeeper server started
: elapsed 31198 : OK
     [exec] Zookeeper_simpleSystem::testHangingClient : elapsed 1071 : OK
     [exec] Zookeeper_simpleSystem::testWatcherAutoResetWithGlobal ZooKeeper server started
ZooKeeper server started ZooKeeper server started : elapsed 15893 : OK
     [exec] Zookeeper_simpleSystem::testWatcherAutoResetWithLocal ZooKeeper server started
ZooKeeper server started ZooKeeper server started : elapsed 16746 : OK
     [exec] Zookeeper_simpleSystem::testGetChildren2 : elapsed 1084 : OK
     [exec] Zookeeper_simpleSystem::testLastZxid : elapsed 4552 : OK
     [exec] Zookeeper_simpleSystem::testRemoveWatchers ZooKeeper server started : elapsed
5274 : OK
     [exec] Zookeeper_readOnly::testReadOnly : elapsed 4301 : OK
     [exec] OK (74)
     [exec] FAIL: zktest-mt
     [exec] ==========================================
     [exec] 1 of 2 tests failed
     [exec] Please report to user@zookeeper.apache.org
     [exec] ==========================================
     [exec] make[1]: Leaving directory `/home/jenkins/jenkins-slave/workspace/ZooKeeper-trunk/build/test/test-cppunit'
     [exec] *** Error in `./zktest-mt': corrupted double-linked list: 0x00000000017f6810 ***
     [exec] /bin/bash: line 5:  1451 Aborted                 ZKROOT=/home/jenkins/jenkins-slave/workspace/ZooKeeper-trunk/src/c/../..
CLASSPATH=$CLASSPATH:$CLOVER_HOME/lib/clover.jar ${dir}$tst
     [exec] make[1]: *** [check-TESTS] Error 1
     [exec] make: *** [check-am] Error 2

BUILD FAILED
/home/jenkins/jenkins-slave/workspace/ZooKeeper-trunk/build.xml:1326: The following error
occurred while executing this line:
/home/jenkins/jenkins-slave/workspace/ZooKeeper-trunk/build.xml:1286: The following error
occurred while executing this line:
/home/jenkins/jenkins-slave/workspace/ZooKeeper-trunk/build.xml:1296: exec returned: 2

Total time: 21 minutes 12 seconds
Build step 'Execute shell' marked build as failure
[FINDBUGS] Skipping publisher since build result is FAILURE
[WARNINGS] Skipping publisher since build result is FAILURE
Archiving artifacts
Setting JDK_1_7_LATEST__HOME=/home/jenkins/tools/java/latest1.7
Recording fingerprints
Setting JDK_1_7_LATEST__HOME=/home/jenkins/tools/java/latest1.7
Error updating JIRA issues. Saving issues for next build.
java.lang.NullPointerException
Recording test results
Setting JDK_1_7_LATEST__HOME=/home/jenkins/tools/java/latest1.7
Publishing Javadoc
Setting JDK_1_7_LATEST__HOME=/home/jenkins/tools/java/latest1.7
Setting JDK_1_7_LATEST__HOME=/home/jenkins/tools/java/latest1.7
Email was triggered for: Failure - Any
Sending email for trigger: Failure - Any
Setting JDK_1_7_LATEST__HOME=/home/jenkins/tools/java/latest1.7
Setting JDK_1_7_LATEST__HOME=/home/jenkins/tools/java/latest1.7



###################################################################################
############################## FAILED TESTS (if any) ##############################
All tests passed
Mime
  • Unnamed multipart/mixed (inline, None, 0 bytes)
View raw message