zookeeper-dev mailing list archives

Site index · List index
Message view « Date » · « Thread »
Top « Date » · « Thread »
From Apache Jenkins Server <jenk...@builds.apache.org>
Subject ZooKeeper-trunk-jdk8 - Build # 918 - Still Failing
Date Sat, 28 Jan 2017 12:00:11 GMT
See https://builds.apache.org/job/ZooKeeper-trunk-jdk8/918/

###################################################################################
########################## LAST 60 LINES OF THE CONSOLE ###########################
[...truncated 458369 lines...]
    [junit] 2017-01-28 11:59:52,739 [myid:] - INFO  [main:PrepRequestProcessor@1009] - Shutting
down
    [junit] 2017-01-28 11:59:52,740 [myid:] - INFO  [main:SyncRequestProcessor@191] - Shutting
down
    [junit] 2017-01-28 11:59:52,740 [myid:] - INFO  [ProcessThread(sid:0 cport:27626)::PrepRequestProcessor@157]
- PrepRequestProcessor exited loop!
    [junit] 2017-01-28 11:59:52,740 [myid:] - INFO  [SyncThread:0:SyncRequestProcessor@169]
- SyncRequestProcessor exited!
    [junit] 2017-01-28 11:59:52,740 [myid:] - INFO  [main:FinalRequestProcessor@481] - shutdown
of request processor complete
    [junit] 2017-01-28 11:59:52,741 [myid:] - INFO  [main:MBeanRegistry@128] - Unregister
MBean [org.apache.ZooKeeperService:name0=StandaloneServer_port27626,name1=InMemoryDataTree]
    [junit] 2017-01-28 11:59:52,741 [myid:] - INFO  [main:MBeanRegistry@128] - Unregister
MBean [org.apache.ZooKeeperService:name0=StandaloneServer_port27626]
    [junit] 2017-01-28 11:59:52,741 [myid:] - INFO  [main:FourLetterWordMain@85] - connecting
to 127.0.0.1 27626
    [junit] 2017-01-28 11:59:52,741 [myid:] - INFO  [main:JMXEnv@146] - ensureOnly:[]
    [junit] 2017-01-28 11:59:52,756 [myid:] - INFO  [main:ClientBase@583] - fdcount after
test is: 4834 at start it was 4838
    [junit] 2017-01-28 11:59:52,756 [myid:] - INFO  [main:ZKTestCase$1@65] - SUCCEEDED testWatcherAutoResetWithLocal
    [junit] 2017-01-28 11:59:52,756 [myid:] - INFO  [main:ZKTestCase$1@60] - FINISHED testWatcherAutoResetWithLocal
    [junit] Tests run: 103, Failures: 0, Errors: 0, Skipped: 0, Time elapsed: 566.818 sec,
Thread: 7, Class: org.apache.zookeeper.test.NioNettySuiteTest
    [junit] 2017-01-28 11:59:53,167 [myid:] - INFO  [SessionTracker:SessionTrackerImpl@158]
- SessionTrackerImpl exited loop!
    [junit] 2017-01-28 12:00:06,358 [myid:] - INFO  [main:JUnit4ZKTestRunner$LoggedInvokeMethod@82]
- Memory used 127556
    [junit] 2017-01-28 12:00:06,359 [myid:] - INFO  [main:JUnit4ZKTestRunner$LoggedInvokeMethod@87]
- Number of threads 55
    [junit] 2017-01-28 12:00:06,359 [myid:] - INFO  [main:JUnit4ZKTestRunner$LoggedInvokeMethod@102]
- FINISHED TEST METHOD testManyChildWatchersAutoReset
    [junit] 2017-01-28 12:00:06,359 [myid:] - INFO  [main:ClientBase@558] - tearDown starting
    [junit] 2017-01-28 12:00:06,360 [myid:] - INFO  [ProcessThread(sid:0 cport:19304)::PrepRequestProcessor@618]
- Processed session termination for sessionid: 0x102789d96520000
    [junit] 2017-01-28 12:00:06,384 [myid:] - INFO  [main:ZooKeeper@1324] - Session: 0x102789d96520000
closed
    [junit] 2017-01-28 12:00:06,384 [myid:] - INFO  [main-EventThread:ClientCnxn$EventThread@513]
- EventThread shut down for session: 0x102789d96520000
    [junit] 2017-01-28 12:00:06,384 [myid:] - INFO  [NIOWorkerThread-14:MBeanRegistry@128]
- Unregister MBean [org.apache.ZooKeeperService:name0=StandaloneServer_port19304,name1=Connections,name2=127.0.0.1,name3=0x102789d96520000]
    [junit] 2017-01-28 12:00:06,385 [myid:] - INFO  [ProcessThread(sid:0 cport:19304)::PrepRequestProcessor@618]
- Processed session termination for sessionid: 0x102789d96520001
    [junit] 2017-01-28 12:00:06,385 [myid:] - INFO  [NIOWorkerThread-14:NIOServerCnxn@614]
- Closed socket connection for client /127.0.0.1:58406 which had sessionid 0x102789d96520000
    [junit] 2017-01-28 12:00:06,436 [myid:] - INFO  [NIOWorkerThread-13:MBeanRegistry@128]
- Unregister MBean [org.apache.ZooKeeperService:name0=StandaloneServer_port19304,name1=Connections,name2=127.0.0.1,name3=0x102789d96520001]
    [junit] 2017-01-28 12:00:06,436 [myid:] - INFO  [main-EventThread:ClientCnxn$EventThread@513]
- EventThread shut down for session: 0x102789d96520001
    [junit] 2017-01-28 12:00:06,436 [myid:] - INFO  [NIOWorkerThread-13:NIOServerCnxn@614]
- Closed socket connection for client /127.0.0.1:58427 which had sessionid 0x102789d96520001
    [junit] 2017-01-28 12:00:06,437 [myid:] - INFO  [main:ZooKeeper@1324] - Session: 0x102789d96520001
closed
    [junit] 2017-01-28 12:00:06,437 [myid:] - INFO  [main:ClientBase@528] - STOPPING server
    [junit] 2017-01-28 12:00:06,438 [myid:] - INFO  [ConnnectionExpirer:NIOServerCnxnFactory$ConnectionExpirerThread@583]
- ConnnectionExpirerThread interrupted
    [junit] 2017-01-28 12:00:06,441 [myid:] - INFO  [NIOServerCxnFactory.SelectorThread-1:NIOServerCnxnFactory$SelectorThread@420]
- selector thread exitted run method
    [junit] 2017-01-28 12:00:06,442 [myid:] - INFO  [NIOServerCxnFactory.AcceptThread:0.0.0.0/0.0.0.0:19304:NIOServerCnxnFactory$AcceptThread@219]
- accept thread exitted run method
    [junit] 2017-01-28 12:00:06,442 [myid:] - INFO  [NIOServerCxnFactory.SelectorThread-0:NIOServerCnxnFactory$SelectorThread@420]
- selector thread exitted run method
    [junit] 2017-01-28 12:00:06,443 [myid:] - INFO  [main:ZooKeeperServer@534] - shutting
down
    [junit] 2017-01-28 12:00:06,443 [myid:] - ERROR [main:ZooKeeperServer@506] - ZKShutdownHandler
is not registered, so ZooKeeper server won't take any action on ERROR or SHUTDOWN server state
changes
    [junit] 2017-01-28 12:00:06,443 [myid:] - INFO  [main:SessionTrackerImpl@232] - Shutting
down
    [junit] 2017-01-28 12:00:06,443 [myid:] - INFO  [main:PrepRequestProcessor@1009] - Shutting
down
    [junit] 2017-01-28 12:00:06,443 [myid:] - INFO  [main:SyncRequestProcessor@191] - Shutting
down
    [junit] 2017-01-28 12:00:06,443 [myid:] - INFO  [ProcessThread(sid:0 cport:19304)::PrepRequestProcessor@157]
- PrepRequestProcessor exited loop!
    [junit] 2017-01-28 12:00:06,444 [myid:] - INFO  [SyncThread:0:SyncRequestProcessor@169]
- SyncRequestProcessor exited!
    [junit] 2017-01-28 12:00:06,444 [myid:] - INFO  [main:FinalRequestProcessor@481] - shutdown
of request processor complete
    [junit] 2017-01-28 12:00:06,444 [myid:] - INFO  [main:MBeanRegistry@128] - Unregister
MBean [org.apache.ZooKeeperService:name0=StandaloneServer_port19304,name1=InMemoryDataTree]
    [junit] 2017-01-28 12:00:06,445 [myid:] - INFO  [main:MBeanRegistry@128] - Unregister
MBean [org.apache.ZooKeeperService:name0=StandaloneServer_port19304]
    [junit] 2017-01-28 12:00:06,445 [myid:] - INFO  [main:FourLetterWordMain@85] - connecting
to 127.0.0.1 19304
    [junit] 2017-01-28 12:00:06,446 [myid:] - INFO  [main:JMXEnv@146] - ensureOnly:[]
    [junit] 2017-01-28 12:00:06,453 [myid:] - INFO  [main:ClientBase@583] - fdcount after
test is: 57 at start it was 57
    [junit] 2017-01-28 12:00:06,454 [myid:] - INFO  [main:ZKTestCase$1@65] - SUCCEEDED testManyChildWatchersAutoReset
    [junit] 2017-01-28 12:00:06,454 [myid:] - INFO  [main:ZKTestCase$1@60] - FINISHED testManyChildWatchersAutoReset
    [junit] Tests run: 4, Failures: 0, Errors: 0, Skipped: 0, Time elapsed: 699.361 sec, Thread:
4, Class: org.apache.zookeeper.test.DisconnectedWatcherTest

BUILD FAILED
/home/jenkins/jenkins-slave/workspace/ZooKeeper-trunk-jdk8/build.xml:1211: Tests failed!

Total time: 15 minutes 37 seconds
Build step 'Invoke Ant' marked build as failure
[WARNINGS] Skipping publisher since build result is FAILURE
Recording test results
Email was triggered for: Failure - Any
Sending email for trigger: Failure - Any



###################################################################################
############################## FAILED TESTS (if any) ##############################
2 tests failed.
FAILED:  org.apache.zookeeper.server.quorum.ReconfigFailureCasesTest.testLeaderTimesoutOnNewQuorum

Error Message:
expected:<[leaderelection]> but was:<[following]>

Stack Trace:
junit.framework.AssertionFailedError: expected:<[leaderelection]> but was:<[following]>
	at org.apache.zookeeper.server.quorum.ReconfigFailureCasesTest.testLeaderTimesoutOnNewQuorum(ReconfigFailureCasesTest.java:197)
	at org.apache.zookeeper.JUnit4ZKTestRunner$LoggedInvokeMethod.evaluate(JUnit4ZKTestRunner.java:79)


FAILED:  org.apache.zookeeper.test.SSLTest.testSecureQuorumServer

Error Message:
waiting for server 0 being up

Stack Trace:
junit.framework.AssertionFailedError: waiting for server 0 being up
	at org.apache.zookeeper.test.SSLTest.testSecureQuorumServer(SSLTest.java:96)
	at org.apache.zookeeper.JUnit4ZKTestRunner$LoggedInvokeMethod.evaluate(JUnit4ZKTestRunner.java:79)



Mime
  • Unnamed multipart/mixed (inline, None, 0 bytes)
View raw message