zookeeper-dev mailing list archives

Site index · List index
Message view « Date » · « Thread »
Top « Date » · « Thread »
From Apache Jenkins Server <jenk...@builds.apache.org>
Subject ZooKeeper-trunk-WinVS2008 - Build # 2393 - Still Failing
Date Tue, 03 Jan 2017 20:11:32 GMT
See https://builds.apache.org/job/ZooKeeper-trunk-WinVS2008/2393/

###################################################################################
########################## LAST 60 LINES OF THE CONSOLE ###########################
[...truncated 119 lines...]
   [javacc] File "ParseException.java" does not exist.  Will create one.
   [javacc] File "Token.java" does not exist.  Will create one.
   [javacc] File "SimpleCharStream.java" does not exist.  Will create one.
   [javacc] Parser generated successfully.

jute:
    [javac] Compiling 39 source files to f:\jenkins\jenkins-slave\workspace\ZooKeeper-trunk-WinVS2008\build\classes
    [javac] warning: [options] bootstrap class path not set in conjunction with -source 1.7
    [javac] 1 warning

compile_jute_uptodate:

compile_jute:
    [mkdir] Created dir: f:\jenkins\jenkins-slave\workspace\ZooKeeper-trunk-WinVS2008\src\java\generated
    [mkdir] Created dir: f:\jenkins\jenkins-slave\workspace\ZooKeeper-trunk-WinVS2008\src\c\generated
     [java] ../../zookeeper.jute Parsed Successfully
     [java] ../../zookeeper.jute Parsed Successfully
    [touch] Creating f:\jenkins\jenkins-slave\workspace\ZooKeeper-trunk-WinVS2008\src\java\generated\.generated

BUILD SUCCESSFUL
Total time: 6 seconds
[ZooKeeper-trunk-WinVS2008] $ cmd /c call C:\Users\jenkins\AppData\Local\Temp\1\hudson4917533500283519574.bat

f:\jenkins\jenkins-slave\workspace\ZooKeeper-trunk-WinVS2008>set ZOOKEEPER_HOME=f:\jenkins\jenkins-slave\workspace\ZooKeeper-trunk-WinVS2008


f:\jenkins\jenkins-slave\workspace\ZooKeeper-trunk-WinVS2008>C:/Windows/Microsoft.NET/Framework/v4.0.30319/msbuild
src/c/zookeeper.sln /p:Configuration=Release 
Microsoft (R) Build Engine version 4.6.1055.0
[Microsoft .NET Framework, version 4.0.30319.42000]
Copyright (C) Microsoft Corporation. All rights reserved.

Building the projects in this solution one at a time. To enable parallel build, please add
the "/m" switch.
Build started 1/3/2017 12:11:34 PM.
Project "f:\jenkins\jenkins-slave\workspace\ZooKeeper-trunk-WinVS2008\src\c\zookeeper.sln"
on node 1 (default targets).
ValidateSolutionConfiguration:
  Building solution configuration "Release|Win32".
MSBUILD : error MSB3411: Could not load the Visual C++ component "VCBuild.exe". If the component
is not installed, either 1) install the Microsoft Windows SDK for Windows Server 2008 and
.NET Framework 3.5, or 2) install Microsoft Visual Studio 2008.  [f:\jenkins\jenkins-slave\workspace\ZooKeeper-trunk-WinVS2008\src\c\zookeeper.sln]
MSBUILD : error MSB3411: Could not load the Visual C++ component "VCBuild.exe". If the component
is not installed, either 1) install the Microsoft Windows SDK for Windows Server 2008 and
.NET Framework 3.5, or 2) install Microsoft Visual Studio 2008.  [f:\jenkins\jenkins-slave\workspace\ZooKeeper-trunk-WinVS2008\src\c\zookeeper.sln]
Done Building Project "f:\jenkins\jenkins-slave\workspace\ZooKeeper-trunk-WinVS2008\src\c\zookeeper.sln"
(default targets) -- FAILED.

Build FAILED.

"f:\jenkins\jenkins-slave\workspace\ZooKeeper-trunk-WinVS2008\src\c\zookeeper.sln" (default
target) (1) ->
(zookeeper target) -> 
  MSBUILD : error MSB3411: Could not load the Visual C++ component "VCBuild.exe". If the component
is not installed, either 1) install the Microsoft Windows SDK for Windows Server 2008 and
.NET Framework 3.5, or 2) install Microsoft Visual Studio 2008.  [f:\jenkins\jenkins-slave\workspace\ZooKeeper-trunk-WinVS2008\src\c\zookeeper.sln]


"f:\jenkins\jenkins-slave\workspace\ZooKeeper-trunk-WinVS2008\src\c\zookeeper.sln" (default
target) (1) ->
(Cli target) -> 
  MSBUILD : error MSB3411: Could not load the Visual C++ component "VCBuild.exe". If the component
is not installed, either 1) install the Microsoft Windows SDK for Windows Server 2008 and
.NET Framework 3.5, or 2) install Microsoft Visual Studio 2008.  [f:\jenkins\jenkins-slave\workspace\ZooKeeper-trunk-WinVS2008\src\c\zookeeper.sln]

    0 Warning(s)
    2 Error(s)

Time Elapsed 00:00:00.42

f:\jenkins\jenkins-slave\workspace\ZooKeeper-trunk-WinVS2008>exit 1 
Build step 'Execute Windows batch command' marked build as failure
Email was triggered for: Failure - Any
Sending email for trigger: Failure - Any



###################################################################################
############################## FAILED TESTS (if any) ##############################
No tests ran.
Mime
  • Unnamed multipart/mixed (inline, None, 0 bytes)
View raw message