zookeeper-dev mailing list archives

Site index · List index
Message view « Date » · « Thread »
Top « Date » · « Thread »
From Apache Jenkins Server <jenk...@builds.apache.org>
Subject ZooKeeper-trunk-solaris - Build # 1447 - Still Failing
Date Sun, 01 Jan 2017 08:03:13 GMT
See https://builds.apache.org/job/ZooKeeper-trunk-solaris/1447/

###################################################################################
########################## LAST 60 LINES OF THE CONSOLE ###########################
[...truncated 137919 lines...]
    [junit] 2017-01-01 08:04:02,468 [myid:] - INFO  [main:JUnit4ZKTestRunner$LoggedInvokeMethod@77]
- RUNNING TEST METHOD testMutipleWatcherObjs
    [junit] 2017-01-01 08:04:02,468 [myid:] - INFO  [NIOWorkerThread-7:NIOServerCnxn@614]
- Closed socket connection for client /127.0.0.1:35377 which had sessionid 0x125d6082cfd0000
    [junit] 2017-01-01 08:04:02,468 [myid:] - INFO  [main:ZooKeeper@855] - Initiating client
connection, connectString=127.0.0.1:11235/chrootclienttest sessionTimeout=30000 watcher=org.apache.zookeeper.test.ClientBase$CountdownWatcher@4f3c89
    [junit] 2017-01-01 08:04:02,469 [myid:] - INFO  [main:ClientCnxnSocket@236] - jute.maxbuffer
value is 4194304 Bytes
    [junit] 2017-01-01 08:04:02,470 [myid:127.0.0.1:11235] - INFO  [main-SendThread(127.0.0.1:11235):ClientCnxn$SendThread@1113]
- Opening socket connection to server 127.0.0.1/127.0.0.1:11235. Will not attempt to authenticate
using SASL (unknown error)
    [junit] 2017-01-01 08:04:02,470 [myid:127.0.0.1:11235] - INFO  [main-SendThread(127.0.0.1:11235):ClientCnxn$SendThread@948]
- Socket connection established, initiating session, client: null, server: null
    [junit] 2017-01-01 08:04:02,470 [myid:] - INFO  [NIOServerCxnFactory.AcceptThread:0.0.0.0/0.0.0.0:11235:NIOServerCnxnFactory$AcceptThread@296]
- Accepted socket connection from /127.0.0.1:35378
    [junit] 2017-01-01 08:04:02,471 [myid:] - INFO  [NIOWorkerThread-8:ZooKeeperServer@1000]
- Client attempting to establish new session at /127.0.0.1:35378
    [junit] 2017-01-01 08:04:02,492 [myid:] - INFO  [SyncThread:0:ZooKeeperServer@714] - Established
session 0x125d6082cfd0001 with negotiated timeout 30000 for client /127.0.0.1:35378
    [junit] 2017-01-01 08:04:02,493 [myid:127.0.0.1:11235] - INFO  [main-SendThread(127.0.0.1:11235):ClientCnxn$SendThread@1381]
- Session establishment complete on server null, sessionid = 0x125d6082cfd0001, negotiated
timeout = 30000
    [junit] 2017-01-01 08:04:02,496 [myid:] - INFO  [main:JMXEnv@117] - expect:0x125d6082cfd0001
    [junit] 2017-01-01 08:04:02,496 [myid:] - INFO  [main:JMXEnv@120] - found:0x125d6082cfd0001
org.apache.ZooKeeperService:name0=StandaloneServer_port11235,name1=Connections,name2=127.0.0.1,name3=0x125d6082cfd0001
    [junit] 2017-01-01 08:04:03,261 [myid:] - INFO  [SessionTracker:SessionTrackerImpl@158]
- SessionTrackerImpl exited loop!
    [junit] 2017-01-01 08:04:03,261 [myid:] - INFO  [SessionTracker:SessionTrackerImpl@158]
- SessionTrackerImpl exited loop!
    [junit] 2017-01-01 08:04:03,261 [myid:] - INFO  [SessionTracker:SessionTrackerImpl@158]
- SessionTrackerImpl exited loop!
    [junit] 2017-01-01 08:04:03,261 [myid:] - INFO  [SessionTracker:SessionTrackerImpl@158]
- SessionTrackerImpl exited loop!
    [junit] 2017-01-01 08:04:05,728 [myid:] - INFO  [ProcessThread(sid:0 cport:11235)::PrepRequestProcessor@618]
- Processed session termination for sessionid: 0x125d6082cfd0001
    [junit] 2017-01-01 08:04:05,729 [myid:] - INFO  [NIOWorkerThread-4:MBeanRegistry@128]
- Unregister MBean [org.apache.ZooKeeperService:name0=StandaloneServer_port11235,name1=Connections,name2=127.0.0.1,name3=0x125d6082cfd0001]
    [junit] 2017-01-01 08:04:05,729 [myid:] - INFO  [NIOWorkerThread-4:NIOServerCnxn@614]
- Closed socket connection for client /127.0.0.1:35378 which had sessionid 0x125d6082cfd0001
    [junit] 2017-01-01 08:04:05,729 [myid:] - INFO  [main:ZooKeeper@1313] - Session: 0x125d6082cfd0001
closed
    [junit] 2017-01-01 08:04:05,729 [myid:] - INFO  [main-EventThread:ClientCnxn$EventThread@513]
- EventThread shut down for session: 0x125d6082cfd0001
    [junit] 2017-01-01 08:04:05,729 [myid:] - INFO  [main:JUnit4ZKTestRunner$LoggedInvokeMethod@82]
- Memory used 15990
    [junit] 2017-01-01 08:04:05,730 [myid:] - INFO  [main:JUnit4ZKTestRunner$LoggedInvokeMethod@87]
- Number of threads 37
    [junit] 2017-01-01 08:04:05,730 [myid:] - INFO  [main:JUnit4ZKTestRunner$LoggedInvokeMethod@102]
- FINISHED TEST METHOD testMutipleWatcherObjs
    [junit] 2017-01-01 08:04:05,730 [myid:] - INFO  [main:ClientBase@543] - tearDown starting
    [junit] 2017-01-01 08:04:05,730 [myid:] - INFO  [main:ClientBase@513] - STOPPING server
    [junit] 2017-01-01 08:04:05,730 [myid:] - INFO  [ConnnectionExpirer:NIOServerCnxnFactory$ConnectionExpirerThread@583]
- ConnnectionExpirerThread interrupted
    [junit] 2017-01-01 08:04:05,731 [myid:] - INFO  [NIOServerCxnFactory.AcceptThread:0.0.0.0/0.0.0.0:11235:NIOServerCnxnFactory$AcceptThread@219]
- accept thread exitted run method
    [junit] 2017-01-01 08:04:05,731 [myid:] - INFO  [NIOServerCxnFactory.SelectorThread-1:NIOServerCnxnFactory$SelectorThread@420]
- selector thread exitted run method
    [junit] 2017-01-01 08:04:05,732 [myid:] - INFO  [NIOServerCxnFactory.SelectorThread-0:NIOServerCnxnFactory$SelectorThread@420]
- selector thread exitted run method
    [junit] 2017-01-01 08:04:05,733 [myid:] - INFO  [main:ZooKeeperServer@534] - shutting
down
    [junit] 2017-01-01 08:04:05,733 [myid:] - ERROR [main:ZooKeeperServer@506] - ZKShutdownHandler
is not registered, so ZooKeeper server won't take any action on ERROR or SHUTDOWN server state
changes
    [junit] 2017-01-01 08:04:05,733 [myid:] - INFO  [main:SessionTrackerImpl@232] - Shutting
down
    [junit] 2017-01-01 08:04:05,733 [myid:] - INFO  [main:PrepRequestProcessor@1009] - Shutting
down
    [junit] 2017-01-01 08:04:05,734 [myid:] - INFO  [main:SyncRequestProcessor@191] - Shutting
down
    [junit] 2017-01-01 08:04:05,734 [myid:] - INFO  [ProcessThread(sid:0 cport:11235)::PrepRequestProcessor@157]
- PrepRequestProcessor exited loop!
    [junit] 2017-01-01 08:04:05,734 [myid:] - INFO  [SyncThread:0:SyncRequestProcessor@169]
- SyncRequestProcessor exited!
    [junit] 2017-01-01 08:04:05,734 [myid:] - INFO  [main:FinalRequestProcessor@481] - shutdown
of request processor complete
    [junit] 2017-01-01 08:04:05,734 [myid:] - INFO  [main:MBeanRegistry@128] - Unregister
MBean [org.apache.ZooKeeperService:name0=StandaloneServer_port11235,name1=InMemoryDataTree]
    [junit] 2017-01-01 08:04:05,735 [myid:] - INFO  [main:MBeanRegistry@128] - Unregister
MBean [org.apache.ZooKeeperService:name0=StandaloneServer_port11235]
    [junit] 2017-01-01 08:04:05,735 [myid:] - INFO  [main:FourLetterWordMain@85] - connecting
to 127.0.0.1 11235
    [junit] 2017-01-01 08:04:05,735 [myid:] - INFO  [main:JMXEnv@146] - ensureOnly:[]
    [junit] 2017-01-01 08:04:05,740 [myid:] - INFO  [main:ClientBase@568] - fdcount after
test is: 60 at start it was 68
    [junit] 2017-01-01 08:04:05,740 [myid:] - INFO  [main:ZKTestCase$1@65] - SUCCEEDED testMutipleWatcherObjs
    [junit] 2017-01-01 08:04:05,740 [myid:] - INFO  [main:ZKTestCase$1@60] - FINISHED testMutipleWatcherObjs
    [junit] Tests run: 14, Failures: 0, Errors: 0, Time elapsed: 72.951 sec
    [junit] Running org.apache.zookeeper.test.ChrootTest
    [junit] Tests run: 1, Failures: 0, Errors: 1, Time elapsed: 0 sec

BUILD FAILED
/zonestorage/hudson_solaris/home/hudson/hudson-slave/workspace/ZooKeeper-trunk-solaris/build.xml:1221:
Process fork failed.

Total time: 47 minutes 8 seconds
Build step 'Invoke Ant' marked build as failure
[locks-and-latches] Releasing all the locks
[locks-and-latches] All the locks released
Recording test results
Email was triggered for: Failure - Any
Sending email for trigger: Failure - Any



###################################################################################
############################## FAILED TESTS (if any) ##############################
1 tests failed.
FAILED:  org.apache.zookeeper.test.ChrootTest.unknown

Error Message:
Forked Java VM exited abnormally. Please note the time in the report does not reflect the
time until the VM exit.

Stack Trace:
junit.framework.AssertionFailedError: Forked Java VM exited abnormally. Please note the time
in the report does not reflect the time until the VM exit.



Mime
  • Unnamed multipart/mixed (inline, None, 0 bytes)
View raw message